null
SMILES: COc1cc2c(N)nc(nc2c(F)c1OC)N1CCN(CC1)C(=O)c1cc2cc(ccc2[nH]1)C#N
InChI Key: InChIKey=HYCLBMINWCOKDX-UHFFFAOYSA-N
Activity Spreadsheet -- Enzyme Inhibition Constant Data from BindingDB
Found 1 hit for monomerid = 251338
Trg + Lig
Ki
nM
ΔG°
kcal/mole
IC50
nM
Kd
nM
EC50/IC50
nM
koff
s-1
kon
M-1s-1
pHTemp
°C
Cobra venom factor/Complement factor B/Complement factor D
(Naja kaouthia (Monocled cobra) (Naja siamensis)-Ho...)
BDBM251338
(US9452990, 18)
Show SMILES COc1cc2c(N)nc(nc2c(F)c1OC)N1CCN(CC1)C(=O)c1cc2cc(ccc2[nH]1)C#N
Show InChI InChI=1S/C24H22FN7O3/c1-34-18-11-15-20(19(25)21(18)35-2)29-24(30-22(15)27)32-7-5-31(6-8-32)23(33)17-10-14-9-13(12-26)3-4-16(14)28-17/h3-4,9-11,28H,5-8H2,1-2H3,(H2,27,29,30)
US Patent
n/an/a 20n/an/an/an/a7.425
NOVARTIS AG
US Patent
Assay Description
CVF-Bb complex prepared from purified cobra venom factor (1 μM), recombinant human complement factor B (expressed in drosophila cells and purifi...
US Patent US9452990 (2016)
BindingDB Entry DOI: 10.7270/Q2H130Z9