BDBM251418 US9452990, 100
SMILES: COCCN[C@H](CC(=O)N1CCN(CC1)c1nc(N)c2cc(OC)c(OC)c(F)c2n1)c1ccc(F)cc1
InChI Key: InChIKey=DDEAUMTYGWOPRL-LJQANCHMSA-N
Data: 1 IC50
Activity Spreadsheet -- Enzyme Inhibition Constant Data from BindingDB
Found 1 hit for monomerid = 251418
Trg + Lig
Ki
nM
ΔG°
kcal/mole
IC50
nM
Kd
nM
EC50/IC50
nM
koff
s-1
kon
M-1s-1
pHTemp
°C
Cobra venom factor/Complement factor B/Complement factor D
(Naja kaouthia (Monocled cobra) (Naja siamensis)-Ho...)
BDBM251418
(US9452990, 100)
Show SMILES COCCN[C@H](CC(=O)N1CCN(CC1)c1nc(N)c2cc(OC)c(OC)c(F)c2n1)c1ccc(F)cc1 |r|
Show InChI InChI=1S/C26H32F2N6O4/c1-36-13-8-30-19(16-4-6-17(27)7-5-16)15-21(35)33-9-11-34(12-10-33)26-31-23-18(25(29)32-26)14-20(37-2)24(38-3)22(23)28/h4-7,14,19,30H,8-13,15H2,1-3H3,(H2,29,31,32)/t19-/m1/s1
US Patent
n/an/a 20n/an/an/an/a7.425
NOVARTIS AG
US Patent
Assay Description
CVF-Bb complex prepared from purified cobra venom factor (1 μM), recombinant human complement factor B (expressed in drosophila cells and purifi...
US Patent US9452990 (2016)
BindingDB Entry DOI: 10.7270/Q2H130Z9