BDBM251626 US9453031, 63
SMILES: CC(C)Nc1nc2ccccc2n1-c1nc2N3CCOC[C@H]3COc2c(n1)C(C)(C)S(C)(=O)=O
InChI Key: InChIKey=GJTBJFGVLOFSGK-HNNXBMFYSA-N
Data: 3 IC50
Activity Spreadsheet -- Enzyme Inhibition Constant Data from BindingDB
Found 3 hits for monomerid = 251626
Trg + Lig
Ki
nM
ΔG°
kcal/mole
IC50
nM
Kd
nM
EC50/IC50
nM
koff
s-1
kon
M-1s-1
pHTemp
°C
p110α/p85α
(Homo sapiens (Human))
BDBM251626
(US9453031, 63)
Show SMILES CC(C)Nc1nc2ccccc2n1-c1nc2N3CCOC[C@H]3COc2c(n1)C(C)(C)S(C)(=O)=O |r|
Show InChI InChI=1S/C23H30N6O4S/c1-14(2)24-21-25-16-8-6-7-9-17(16)29(21)22-26-19(23(3,4)34(5,30)31)18-20(27-22)28-10-11-32-12-15(28)13-33-18/h6-9,14-15H,10-13H2,1-5H3,(H,24,25)/t15-/m0/s1
US Patent
n/an/a 6.61E+3n/an/an/an/a7.525
Fundación Centro Nacional de Investigaciones Oncológicas Carlos III
US Patent
Assay Description
The kinase activity was measured by using the commercial ADP Hunter Plus assay available from DiscoveRx (#33-016), which is a homogeneous assay to me...
US Patent US9453031 (2016)
BindingDB Entry DOI: 10.7270/Q27H1HH8
DNA-dependent protein kinase catalytic subunit
(Homo sapiens (Human))
BDBM251626
(US9453031, 63)
Show SMILES CC(C)Nc1nc2ccccc2n1-c1nc2N3CCOC[C@H]3COc2c(n1)C(C)(C)S(C)(=O)=O |r|
Show InChI InChI=1S/C23H30N6O4S/c1-14(2)24-21-25-16-8-6-7-9-17(16)29(21)22-26-19(23(3,4)34(5,30)31)18-20(27-22)28-10-11-32-12-15(28)13-33-18/h6-9,14-15H,10-13H2,1-5H3,(H,24,25)/t15-/m0/s1
US Patent
n/an/a 4.30E+3n/an/an/an/a7.537
Fundación Centro Nacional de Investigaciones Oncológicas Carlos III
US Patent
Assay Description
The kinase activity was measured by using the commercial ADP Hunter Plus assay available from DiscoveRx (#90-0083), which is a homogeneous assay to m...
US Patent US9453031 (2016)
BindingDB Entry DOI: 10.7270/Q27H1HH8
Serine/threonine-protein kinase mTOR
(Homo sapiens (Human))
BDBM251626
(US9453031, 63)
Show SMILES CC(C)Nc1nc2ccccc2n1-c1nc2N3CCOC[C@H]3COc2c(n1)C(C)(C)S(C)(=O)=O |r|
Show InChI InChI=1S/C23H30N6O4S/c1-14(2)24-21-25-16-8-6-7-9-17(16)29(21)22-26-19(23(3,4)34(5,30)31)18-20(27-22)28-10-11-32-12-15(28)13-33-18/h6-9,14-15H,10-13H2,1-5H3,(H,24,25)/t15-/m0/s1
US Patent
n/an/a 252n/an/an/an/a7.525
Fundación Centro Nacional de Investigaciones Oncológicas Carlos III
US Patent
Assay Description
The enzymatic mTOR activity was measured using a LanthaScreen kinase activity assay (Invitrogen). The enzyme was purchased from Invitrogen (PV4754), ...
US Patent US9453031 (2016)
BindingDB Entry DOI: 10.7270/Q27H1HH8