BDBM251643 US9453031, 80
SMILES: CNc1nc2cc(Cl)ccc2n1-c1nc2N3CCOC[C@H]3COc2c(n1)C(C)(C)S(C)(=O)=O
InChI Key: InChIKey=KKUPXJPQILWABM-ZDUSSCGKSA-N
Data: 3 IC50
Activity Spreadsheet -- Enzyme Inhibition Constant Data from BindingDB
Found 3 hits for monomerid = 251643
Trg + Lig
Ki
nM
ΔG°
kcal/mole
IC50
nM
Kd
nM
EC50/IC50
nM
koff
s-1
kon
M-1s-1
pHTemp
°C
p110α/p85α
(Homo sapiens (Human))
BDBM251643
(US9453031, 80)
Show SMILES CNc1nc2cc(Cl)ccc2n1-c1nc2N3CCOC[C@H]3COc2c(n1)C(C)(C)S(C)(=O)=O |r|
Show InChI InChI=1S/C21H25ClN6O4S/c1-21(2,33(4,29)30)17-16-18(27-7-8-31-10-13(27)11-32-16)26-20(25-17)28-15-6-5-12(22)9-14(15)24-19(28)23-3/h5-6,9,13H,7-8,10-11H2,1-4H3,(H,23,24)/t13-/m0/s1
US Patent
n/an/a 1.31E+4n/an/an/an/a7.525
Fundación Centro Nacional de Investigaciones Oncológicas Carlos III
US Patent
Assay Description
The kinase activity was measured by using the commercial ADP Hunter Plus assay available from DiscoveRx (#33-016), which is a homogeneous assay to me...
US Patent US9453031 (2016)
BindingDB Entry DOI: 10.7270/Q27H1HH8
DNA-dependent protein kinase catalytic subunit
(Homo sapiens (Human))
BDBM251643
(US9453031, 80)
Show SMILES CNc1nc2cc(Cl)ccc2n1-c1nc2N3CCOC[C@H]3COc2c(n1)C(C)(C)S(C)(=O)=O |r|
Show InChI InChI=1S/C21H25ClN6O4S/c1-21(2,33(4,29)30)17-16-18(27-7-8-31-10-13(27)11-32-16)26-20(25-17)28-15-6-5-12(22)9-14(15)24-19(28)23-3/h5-6,9,13H,7-8,10-11H2,1-4H3,(H,23,24)/t13-/m0/s1
US Patent
n/an/a 1.00E+4n/an/an/an/a7.537
Fundación Centro Nacional de Investigaciones Oncológicas Carlos III
US Patent
Assay Description
The kinase activity was measured by using the commercial ADP Hunter Plus assay available from DiscoveRx (#90-0083), which is a homogeneous assay to m...
US Patent US9453031 (2016)
BindingDB Entry DOI: 10.7270/Q27H1HH8
Serine/threonine-protein kinase mTOR
(Homo sapiens (Human))
BDBM251643
(US9453031, 80)
Show SMILES CNc1nc2cc(Cl)ccc2n1-c1nc2N3CCOC[C@H]3COc2c(n1)C(C)(C)S(C)(=O)=O |r|
Show InChI InChI=1S/C21H25ClN6O4S/c1-21(2,33(4,29)30)17-16-18(27-7-8-31-10-13(27)11-32-16)26-20(25-17)28-15-6-5-12(22)9-14(15)24-19(28)23-3/h5-6,9,13H,7-8,10-11H2,1-4H3,(H,23,24)/t13-/m0/s1
US Patent
n/an/a 501n/an/an/an/a7.525
Fundación Centro Nacional de Investigaciones Oncológicas Carlos III
US Patent
Assay Description
The enzymatic mTOR activity was measured using a LanthaScreen kinase activity assay (Invitrogen). The enzyme was purchased from Invitrogen (PV4754), ...
US Patent US9453031 (2016)
BindingDB Entry DOI: 10.7270/Q27H1HH8