BDBM25174 1-[(5-methanesulfonylthiophen-2-yl)carbonyl]-2,3-dihydro-1H-indole::thiophene derivative, 17h
SMILES: CS(=O)(=O)c1ccc(s1)C(=O)N1CCc2ccccc12
InChI Key: InChIKey=TXURGPYCGHPNBT-UHFFFAOYSA-N
Data: 5 Other
Activity Spreadsheet -- Enzyme Inhibition Constant Data from BindingDB
Found 5 hits for monomerid = 25174
Trg + Lig
Ki
nM
ΔG°
kcal/mole
IC50
nM
Kd
nM
EC50/IC50
nM
koff
s-1
kon
M-1s-1
pHTemp
°C
Histone deacetylase 6
(Homo sapiens (Human))
BDBM25174
(1-[(5-methanesulfonylthiophen-2-yl)carbonyl]-2,3-d...)
Show SMILES CS(=O)(=O)c1ccc(s1)C(=O)N1CCc2ccccc12
Show InChI InChI=1S/C14H13NO3S2/c1-20(17,18)13-7-6-12(19-13)14(16)15-9-8-10-4-2-3-5-11(10)15/h2-7H,8-9H2,1H3
NCI pathway
Reactome pathway
n/an/an/an/an/an/an/an/a25
IRBM/Merck
Assay Description
The Fluor-de-Lys HDAC activity assay kit (Biomol) was used. Purified recombinant HDAC enzyme was incubated with Fluor-de-Lys substrate in the presenc...
Bioorg Med Chem Lett 18: 3456-61 (2008)
Article DOI: 10.1016/j.bmcl.2008.02.026
BindingDB Entry DOI: 10.7270/Q2MS3R28
Histone deacetylase 1
(Homo sapiens (Human))
BDBM25174
(1-[(5-methanesulfonylthiophen-2-yl)carbonyl]-2,3-d...)
Show SMILES CS(=O)(=O)c1ccc(s1)C(=O)N1CCc2ccccc12
Show InChI InChI=1S/C14H13NO3S2/c1-20(17,18)13-7-6-12(19-13)14(16)15-9-8-10-4-2-3-5-11(10)15/h2-7H,8-9H2,1H3
NCI pathway
Reactome pathway
n/an/an/an/an/an/an/a8.037
IRBM/Merck
Assay Description
The Fluor-de-Lys HDAC activity assay kit (Biomol) was used. Purified recombinant HDAC enzyme was incubated with Fluor-de-Lys substrate in the presenc...
Bioorg Med Chem Lett 18: 3456-61 (2008)
Article DOI: 10.1016/j.bmcl.2008.02.026
BindingDB Entry DOI: 10.7270/Q2MS3R28
Histone deacetylase 4
(Homo sapiens (Human))
BDBM25174
(1-[(5-methanesulfonylthiophen-2-yl)carbonyl]-2,3-d...)
Show SMILES CS(=O)(=O)c1ccc(s1)C(=O)N1CCc2ccccc12
Show InChI InChI=1S/C14H13NO3S2/c1-20(17,18)13-7-6-12(19-13)14(16)15-9-8-10-4-2-3-5-11(10)15/h2-7H,8-9H2,1H3
n/an/an/an/an/an/an/an/a25
IRBM/Merck
Assay Description
The Fluor-de-Lys HDAC activity assay kit (Biomol) was used. Purified recombinant HDAC enzyme was incubated with Fluor-de-Lys substrate in the presenc...
Bioorg Med Chem Lett 18: 3456-61 (2008)
Article DOI: 10.1016/j.bmcl.2008.02.026
BindingDB Entry DOI: 10.7270/Q2MS3R28
Histone deacetylase 4 [653-1084,H976Y]
(Homo sapiens (Human))
BDBM25174
(1-[(5-methanesulfonylthiophen-2-yl)carbonyl]-2,3-d...)
Show SMILES CS(=O)(=O)c1ccc(s1)C(=O)N1CCc2ccccc12
Show InChI InChI=1S/C14H13NO3S2/c1-20(17,18)13-7-6-12(19-13)14(16)15-9-8-10-4-2-3-5-11(10)15/h2-7H,8-9H2,1H3
n/an/an/an/an/an/an/an/a25
IRBM/Merck
Assay Description
The Fluor-de-Lys HDAC activity assay kit (Biomol) was used. Purified recombinant HDAC enzyme was incubated with Fluor-de-Lys substrate in the presenc...
Bioorg Med Chem Lett 18: 3456-61 (2008)
Article DOI: 10.1016/j.bmcl.2008.02.026
BindingDB Entry DOI: 10.7270/Q2MS3R28
Histone deacetylase 3
(Homo sapiens (Human))
BDBM25174
(1-[(5-methanesulfonylthiophen-2-yl)carbonyl]-2,3-d...)
Show SMILES CS(=O)(=O)c1ccc(s1)C(=O)N1CCc2ccccc12
Show InChI InChI=1S/C14H13NO3S2/c1-20(17,18)13-7-6-12(19-13)14(16)15-9-8-10-4-2-3-5-11(10)15/h2-7H,8-9H2,1H3
NCI pathway
Reactome pathway
n/an/an/an/an/an/an/an/a25
IRBM/Merck
Assay Description
The Fluor-de-Lys HDAC activity assay kit (Biomol) was used. Purified recombinant HDAC enzyme was incubated with Fluor-de-Lys substrate in the presenc...
Bioorg Med Chem Lett 18: 3456-61 (2008)
Article DOI: 10.1016/j.bmcl.2008.02.026
BindingDB Entry DOI: 10.7270/Q2MS3R28