BDBM252175 US9458110, 247
SMILES: COc1cc(ccc1-c1cn[nH]c1)C(=O)NCc1cccc(c1)C(=O)Nc1nc2CCN(C)Cc2s1
InChI Key: InChIKey=YGZVCRLWTNQONT-UHFFFAOYSA-N
Data: 2 IC50
Activity Spreadsheet -- Enzyme Inhibition Constant Data from BindingDB
Found 2 hits for monomerid = 252175
Trg + Lig
Ki
nM
ΔG°
kcal/mole
IC50
nM
Kd
nM
EC50/IC50
nM
koff
s-1
kon
M-1s-1
pHTemp
°C
Rho-associated protein kinase 2
(Homo sapiens (Human))
BDBM252175
(US9458110, 247)
Show SMILES COc1cc(ccc1-c1cn[nH]c1)C(=O)NCc1cccc(c1)C(=O)Nc1nc2CCN(C)Cc2s1
Show InChI InChI=1S/C26H26N6O3S/c1-32-9-8-21-23(15-32)36-26(30-21)31-25(34)17-5-3-4-16(10-17)12-27-24(33)18-6-7-20(22(11-18)35-2)19-13-28-29-14-19/h3-7,10-11,13-14H,8-9,12,15H2,1-2H3,(H,27,33)(H,28,29)(H,30,31,34)
US Patent
n/an/a 0.330n/an/an/an/a7.5n/a
Bristol-Myers Squibb Company
US Patent
Assay Description
The effectiveness of compounds of the present invention as ROCK inhibitors can be determined in a 30 μL assay containing 20 mM HEPES, pH 7.5, 20...
US Patent US9458110 (2016)
BindingDB Entry DOI: 10.7270/Q22V2F2W
Rho-associated protein kinase 1
(Homo sapiens (Human))
BDBM252175
(US9458110, 247)
Show SMILES COc1cc(ccc1-c1cn[nH]c1)C(=O)NCc1cccc(c1)C(=O)Nc1nc2CCN(C)Cc2s1
Show InChI InChI=1S/C26H26N6O3S/c1-32-9-8-21-23(15-32)36-26(30-21)31-25(34)17-5-3-4-16(10-17)12-27-24(33)18-6-7-20(22(11-18)35-2)19-13-28-29-14-19/h3-7,10-11,13-14H,8-9,12,15H2,1-2H3,(H,27,33)(H,28,29)(H,30,31,34)
NCI pathway
Reactome pathway
US Patent
n/an/a 0.390n/an/an/an/a7.5n/a
Bristol-Myers Squibb Company
US Patent
Assay Description
The effectiveness of compounds of the present invention as ROCK inhibitors can be determined in a 30 μL assay containing 20 mM HEPES, pH 7.5, 20...
US Patent US9458110 (2016)
BindingDB Entry DOI: 10.7270/Q22V2F2W