BDBM25260 bisphosphonate, 16::{2-[dodecyl(methyl)amino]-1-phosphonoethyl}phosphonic acid
SMILES: CCCCCCCCCCCCN(C)CC(P(O)(O)=O)P(O)(O)=O
InChI Key: InChIKey=FQYMJTHEUPKDPQ-UHFFFAOYSA-N
Data: 1 IC50
Activity Spreadsheet -- Enzyme Inhibition Constant Data from BindingDB
Found 1 hit for monomerid = 25260
Trg + Lig
Ki
nM
ΔG°
kcal/mole
IC50
nM
Kd
nM
EC50/IC50
nM
koff
s-1
kon
M-1s-1
pHTemp
°C
Geranylgeranyl Diphosphate Synthase (GGPPS)
(Homo sapiens (Human))
BDBM25260
(bisphosphonate, 16 | {2-[dodecyl(methyl)amino]-1-p...)
Show SMILES CCCCCCCCCCCCN(C)CC(P(O)(O)=O)P(O)(O)=O
Show InChI InChI=1S/C15H35NO6P2/c1-3-4-5-6-7-8-9-10-11-12-13-16(2)14-15(23(17,18)19)24(20,21)22/h15H,3-14H2,1-2H3,(H2,17,18,19)(H2,20,21,22)
Reactome pathway
n/an/a 350n/an/an/an/a7.037
National Taiwan University
Assay Description
The inhibitory activity of each test compound was evaluated by monitoring the formation of [14C]GGPP from FPP, using [14C]IPP as the substrate. To co...
J Med Chem 51: 5594-607 (2008)
Article DOI: 10.1021/jm800325y
BindingDB Entry DOI: 10.7270/Q2028PVT