BDBM252619 US9458176, 16
SMILES: COc1cc(ccc1OC(F)(F)F)-c1nc(c2CCO[C@H](CF)Cn12)-c1cc(C)nc(C)c1
InChI Key: InChIKey=OEQIAHHTGPDFSK-QGZVFWFLSA-N
Data: 1 IC50
Activity Spreadsheet -- Enzyme Inhibition Constant Data from BindingDB
Found 1 hit for monomerid = 252619
Trg + Lig
Ki
nM
ΔG°
kcal/mole
IC50
nM
Kd
nM
EC50/IC50
nM
koff
s-1
kon
M-1s-1
pHTemp
°C
Metabotropic glutamate receptor 2
(Homo sapiens (Human))
BDBM252619
(US9458176, 16)
Show SMILES COc1cc(ccc1OC(F)(F)F)-c1nc(c2CCO[C@H](CF)Cn12)-c1cc(C)nc(C)c1 |r|
Show InChI InChI=1S/C23H23F4N3O3/c1-13-8-16(9-14(2)28-13)21-18-6-7-32-17(11-24)12-30(18)22(29-21)15-4-5-19(20(10-15)31-3)33-23(25,26)27/h4-5,8-10,17H,6-7,11-12H2,1-3H3/t17-/m1/s1
US Patent
n/an/a 2.70n/an/an/an/an/a25
Eisai R&D Management Co., Ltd.
US Patent
Assay Description
The frozen cell membrane fraction prepared as described above was thawed before use, and the resultant was diluted with a buffer for a binding assay ...
US Patent US9458176 (2016)
BindingDB Entry DOI: 10.7270/Q2PK0F3D