BDBM252685 US9458176, 82
SMILES: CCOc1cc(ccc1C(F)(F)F)-c1nc(c2CCO[C@H](C)Cn12)-c1cc(C)nc(C)c1
InChI Key: InChIKey=NVGWTIMTJOAYSJ-MRXNPFEDSA-N
Data: 1 IC50
Activity Spreadsheet -- Enzyme Inhibition Constant Data from BindingDB
Found 1 hit for monomerid = 252685
Trg + Lig
Ki
nM
ΔG°
kcal/mole
IC50
nM
Kd
nM
EC50/IC50
nM
koff
s-1
kon
M-1s-1
pHTemp
°C
Metabotropic glutamate receptor 2
(Homo sapiens (Human))
BDBM252685
(US9458176, 82)
Show SMILES CCOc1cc(ccc1C(F)(F)F)-c1nc(c2CCO[C@H](C)Cn12)-c1cc(C)nc(C)c1 |r|
Show InChI InChI=1S/C24H26F3N3O2/c1-5-31-21-12-17(6-7-19(21)24(25,26)27)23-29-22(18-10-14(2)28-15(3)11-18)20-8-9-32-16(4)13-30(20)23/h6-7,10-12,16H,5,8-9,13H2,1-4H3/t16-/m1/s1
US Patent
n/an/a 1.10n/an/an/an/an/a25
Eisai R&D Management Co., Ltd.
US Patent
Assay Description
The frozen cell membrane fraction prepared as described above was thawed before use, and the resultant was diluted with a buffer for a binding assay ...
US Patent US9458176 (2016)
BindingDB Entry DOI: 10.7270/Q2PK0F3D