BDBM252847 US9458176, 244
SMILES: CC(C)Oc1ccc(cc1C)-c1nc(c2CCO[C@H](CF)Cn12)-c1cc(C)nc(C)c1
InChI Key: InChIKey=XZAXSFVOHFUEQA-OAQYLSRUSA-N
Data: 1 IC50
Activity Spreadsheet -- Enzyme Inhibition Constant Data from BindingDB
Found 1 hit for monomerid = 252847
Trg + Lig
Ki
nM
ΔG°
kcal/mole
IC50
nM
Kd
nM
EC50/IC50
nM
koff
s-1
kon
M-1s-1
pHTemp
°C
Metabotropic glutamate receptor 2
(Homo sapiens (Human))
BDBM252847
(US9458176, 244)
Show SMILES CC(C)Oc1ccc(cc1C)-c1nc(c2CCO[C@H](CF)Cn12)-c1cc(C)nc(C)c1 |r|
Show InChI InChI=1S/C25H30FN3O2/c1-15(2)31-23-7-6-19(10-16(23)3)25-28-24(20-11-17(4)27-18(5)12-20)22-8-9-30-21(13-26)14-29(22)25/h6-7,10-12,15,21H,8-9,13-14H2,1-5H3/t21-/m1/s1
US Patent
n/an/a 1.80n/an/an/an/an/a25
Eisai R&D Management Co., Ltd.
US Patent
Assay Description
The frozen cell membrane fraction prepared as described above was thawed before use, and the resultant was diluted with a buffer for a binding assay ...
US Patent US9458176 (2016)
BindingDB Entry DOI: 10.7270/Q2PK0F3D