BDBM252975 US9469608, 2-11
SMILES: NCc1ccc(Cl)cc1CNC(=O)[C@@H]1CCCN1C(=O)c1cc(c[nH]1)C(F)(F)F
InChI Key:
Data: 1 KI
Activity Spreadsheet -- Enzyme Inhibition Constant Data from BindingDB
Found 1 hit for monomerid = 252975
Trg + Lig
Ki
nM
ΔG°
kcal/mole
IC50
nM
Kd
nM
EC50/IC50
nM
koff
s-1
kon
M-1s-1
pHTemp
°C
Prothrombin
(Homo sapiens (Human))
BDBM252975
(US9469608, 2-11)
Show SMILES NCc1ccc(Cl)cc1CNC(=O)[C@@H]1CCCN1C(=O)c1cc(c[nH]1)C(F)(F)F |r|
US Patent
110n/an/an/an/an/an/a7.4n/a
Merck Sharp & Dohme Corp.
US Patent
Assay Description
Relevant in vitro assays are referenced in Morrissette, et al., Bioorg. Med. Chem. Lett. 2004, 14, 4161-4164 and described in Lewis, et al. Thromb. R...
US Patent US9469608 (2016)
BindingDB Entry DOI: 10.7270/Q2F18XNQ