BDBM252998 US9469608, 27-9
SMILES: NCc1ccc(Cl)cc1CNC(=O)[C@@H]1CCCN1C(=O)C1(O)CCc2cnccc12
InChI Key: InChIKey=UKLUJODMQQYJQM-YDNXMHBPSA-N
Data: 1 KI
Activity Spreadsheet -- Enzyme Inhibition Constant Data from BindingDB
Found 1 hit for monomerid = 252998
Trg + Lig
Ki
nM
ΔG°
kcal/mole
IC50
nM
Kd
nM
EC50/IC50
nM
koff
s-1
kon
M-1s-1
pHTemp
°C
Prothrombin
(Homo sapiens (Human))
BDBM252998
(US9469608, 27-9)
Show SMILES NCc1ccc(Cl)cc1CNC(=O)[C@@H]1CCCN1C(=O)C1(O)CCc2cnccc12 |r|
Show InChI InChI=1S/C22H25ClN4O3/c23-17-4-3-14(11-24)16(10-17)13-26-20(28)19-2-1-9-27(19)21(29)22(30)7-5-15-12-25-8-6-18(15)22/h3-4,6,8,10,12,19,30H,1-2,5,7,9,11,13,24H2,(H,26,28)/t19-,22?/m0/s1
US Patent
20n/an/an/an/an/an/a7.4n/a
Merck Sharp & Dohme Corp.
US Patent
Assay Description
Relevant in vitro assays are referenced in Morrissette, et al., Bioorg. Med. Chem. Lett. 2004, 14, 4161-4164 and described in Lewis, et al. Thromb. R...
US Patent US9469608 (2016)
BindingDB Entry DOI: 10.7270/Q2F18XNQ