null
SMILES: OC1(CCc2cccnc12)C(=O)N1CCC[C@H]1C(=O)NCc1cc(Cl)ccc1-n1cnnn1
InChI Key: InChIKey=FZKKXXIXWINQPB-HXBUSHRASA-N
Activity Spreadsheet -- Enzyme Inhibition Constant Data from BindingDB
Found 1 hit for monomerid = 253008
Trg + Lig
Ki
nM
ΔG°
kcal/mole
IC50
nM
Kd
nM
EC50/IC50
nM
koff
s-1
kon
M-1s-1
pHTemp
°C
Prothrombin
(Homo sapiens (Human))
BDBM253008
(US9469608, 36-3)
Show SMILES OC1(CCc2cccnc12)C(=O)N1CCC[C@H]1C(=O)NCc1cc(Cl)ccc1-n1cnnn1 |r|
Show InChI InChI=1S/C22H22ClN7O3/c23-16-5-6-17(30-13-26-27-28-30)15(11-16)12-25-20(31)18-4-2-10-29(18)21(32)22(33)8-7-14-3-1-9-24-19(14)22/h1,3,5-6,9,11,13,18,33H,2,4,7-8,10,12H2,(H,25,31)/t18-,22?/m0/s1
US Patent
2.5n/an/an/an/an/an/a7.4n/a
Merck Sharp & Dohme Corp.
US Patent
Assay Description
Relevant in vitro assays are referenced in Morrissette, et al., Bioorg. Med. Chem. Lett. 2004, 14, 4161-4164 and described in Lewis, et al. Thromb. R...
US Patent US9469608 (2016)
BindingDB Entry DOI: 10.7270/Q2F18XNQ