BDBM25302 CHEMBL277580::bisphosphonate, 49::hydrogen [2-(dimethylsulfanylium)-1-hydroxy-1-phosphonoethyl]phosphonate
SMILES: C[S+](C)CC(O)(P(O)(O)=O)P(O)([O-])=O
InChI Key: InChIKey=JAYKFPQXXHDSSF-UHFFFAOYSA-N
Data: 2 IC50
PDB links: 2 PDB IDs match this monomer.
Activity Spreadsheet -- Enzyme Inhibition Constant Data from BindingDB
Found 2 hits for monomerid = 25302
Trg + Lig
Ki
nM
ΔG°
kcal/mole
IC50
nM
Kd
nM
EC50/IC50
nM
koff
s-1
kon
M-1s-1
pHTemp
°C
Farnesyl diphosphate synthase
(Homo sapiens (Human))
BDBM25302
(CHEMBL277580 | bisphosphonate, 49 | hydrogen [2-(d...)
Show SMILES C[S+](C)CC(O)(P(O)(O)=O)P(O)([O-])=O
Show InChI InChI=1S/C4H12O7P2S/c1-14(2)3-4(5,12(6,7)8)13(9,10)11/h5H,3H2,1-2H3,(H3-,6,7,8,9,10,11)
Reactome pathway
n/an/a 1.00E+3n/an/an/an/an/an/a
University of Illinois at Urbana-Champaign
Curated by ChEMBL
Assay Description
Inhibition of human FPPS
J Med Chem 50: 6067-79 (2007)
Article DOI: 10.1021/jm700991k
BindingDB Entry DOI: 10.7270/Q2CZ36VH
3D
3D Structure (crystal)
Geranylgeranyl Diphosphate Synthase (GGPPS)
(Homo sapiens (Human))
BDBM25302
(CHEMBL277580 | bisphosphonate, 49 | hydrogen [2-(d...)
Show SMILES C[S+](C)CC(O)(P(O)(O)=O)P(O)([O-])=O
Show InChI InChI=1S/C4H12O7P2S/c1-14(2)3-4(5,12(6,7)8)13(9,10)11/h5H,3H2,1-2H3,(H3-,6,7,8,9,10,11)
Reactome pathway
n/an/a 6.61E+4n/an/an/an/an/an/a
National Taiwan University
Assay Description
The inhibitory activity of each test compound was evaluated by monitoring the formation of [14C]GGPP from FPP, using [14C]IPP as the substrate. To co...
J Med Chem 51: 5594-607 (2008)
Article DOI: 10.1021/jm800325y
BindingDB Entry DOI: 10.7270/Q2028PVT