BDBM25333 2-{2-[(dimethylcarbamoyl)amino]propan-2-yl}-N-[(4-fluorophenyl)methyl]-5-hydroxy-1-methyl-6-oxo-1,6-dihydropyrimidine-4-carboxamide::N-methyl-pyrimidinone derivative, 9
SMILES: CN(C)C(=O)NC(C)(C)c1nc(C(=O)NCc2ccc(F)cc2)c(O)c(=O)n1C
InChI Key: InChIKey=PWEVLUAHMYMYHE-UHFFFAOYSA-N
Data: 1 IC50
Activity Spreadsheet -- Enzyme Inhibition Constant Data from BindingDB
Found 1 hit for monomerid = 25333
Trg + Lig
Ki
nM
ΔG°
kcal/mole
IC50
nM
Kd
nM
EC50/IC50
nM
koff
s-1
kon
M-1s-1
pHTemp
°C
Gag-Pol polyprotein
(Human immunodeficiency virus type 1 group M subtyp...)
BDBM25333
(2-{2-[(dimethylcarbamoyl)amino]propan-2-yl}-N-[(4-...)
Show SMILES CN(C)C(=O)NC(C)(C)c1nc(C(=O)NCc2ccc(F)cc2)c(O)c(=O)n1C
Show InChI InChI=1S/C19H24FN5O4/c1-19(2,23-18(29)24(3)4)17-22-13(14(26)16(28)25(17)5)15(27)21-10-11-6-8-12(20)9-7-11/h6-9,26H,10H2,1-5H3,(H,21,27)(H,23,29)
n/an/a 18n/an/an/an/a7.837
Merck Research Laboratories
Assay Description
The microtiter plate assay for stand transfer was performed with an immobilized donor substrate and a target substrate biotinylated at the 3-prime en...
J Med Chem 51: 5843-55 (2008)
Article DOI: 10.1021/jm800245z
BindingDB Entry DOI: 10.7270/Q2QJ7FMR