BDBM25334 2-{2-[(dimethylsulfamoyl)amino]propan-2-yl}-N-[(4-fluorophenyl)methyl]-5-hydroxy-1-methyl-6-oxo-1,6-dihydropyrimidine-4-carboxamide::N-methyl-pyrimidinone derivative, 10
SMILES: CN(C)S(=O)(=O)NC(C)(C)c1nc(C(=O)NCc2ccc(F)cc2)c(O)c(=O)n1C
InChI Key: InChIKey=YEFIJEXZAWLRFG-UHFFFAOYSA-N
Data: 1 IC50
Activity Spreadsheet -- Enzyme Inhibition Constant Data from BindingDB
Found 1 hit for monomerid = 25334
Trg + Lig
Ki
nM
ΔG°
kcal/mole
IC50
nM
Kd
nM
EC50/IC50
nM
koff
s-1
kon
M-1s-1
pHTemp
°C
Gag-Pol polyprotein
(Human immunodeficiency virus type 1 group M subtyp...)
BDBM25334
(2-{2-[(dimethylsulfamoyl)amino]propan-2-yl}-N-[(4-...)
Show SMILES CN(C)S(=O)(=O)NC(C)(C)c1nc(C(=O)NCc2ccc(F)cc2)c(O)c(=O)n1C
Show InChI InChI=1S/C18H24FN5O5S/c1-18(2,22-30(28,29)23(3)4)17-21-13(14(25)16(27)24(17)5)15(26)20-10-11-6-8-12(19)9-7-11/h6-9,22,25H,10H2,1-5H3,(H,20,26)
n/an/a 12n/an/an/an/a7.837
Merck Research Laboratories
Assay Description
The microtiter plate assay for stand transfer was performed with an immobilized donor substrate and a target substrate biotinylated at the 3-prime en...
J Med Chem 51: 5843-55 (2008)
Article DOI: 10.1021/jm800245z
BindingDB Entry DOI: 10.7270/Q2QJ7FMR