BDBM25338 N-[2-(4-{[(4-fluorophenyl)methyl]carbamoyl}-5-hydroxy-1-methyl-6-oxo-1,6-dihydropyrimidin-2-yl)propan-2-yl]-N',N',N''-trimethylethanediamide::N-methyl-pyrimidinone derivative, 14
SMILES: CN(C)C(=O)C(=O)N(C)C(C)(C)c1nc(C(=O)NCc2ccc(F)cc2)c(O)c(=O)n1C
InChI Key: InChIKey=KBWNGLRCTYSSQQ-UHFFFAOYSA-N
Data: 1 IC50
Activity Spreadsheet -- Enzyme Inhibition Constant Data from BindingDB
Found 1 hit for monomerid = 25338
Trg + Lig
Ki
nM
ΔG°
kcal/mole
IC50
nM
Kd
nM
EC50/IC50
nM
koff
s-1
kon
M-1s-1
pHTemp
°C
Gag-Pol polyprotein
(Human immunodeficiency virus type 1 group M subtyp...)
BDBM25338
(N-[2-(4-{[(4-fluorophenyl)methyl]carbamoyl}-5-hydr...)
Show SMILES CN(C)C(=O)C(=O)N(C)C(C)(C)c1nc(C(=O)NCc2ccc(F)cc2)c(O)c(=O)n1C
Show InChI InChI=1S/C21H26FN5O5/c1-21(2,27(6)19(32)18(31)25(3)4)20-24-14(15(28)17(30)26(20)5)16(29)23-11-12-7-9-13(22)10-8-12/h7-10,28H,11H2,1-6H3,(H,23,29)
n/an/a 15n/an/an/an/a7.837
Merck Research Laboratories
Assay Description
The microtiter plate assay for stand transfer was performed with an immobilized donor substrate and a target substrate biotinylated at the 3-prime en...
J Med Chem 51: 5843-55 (2008)
Article DOI: 10.1021/jm800245z
BindingDB Entry DOI: 10.7270/Q2QJ7FMR