BDBM25340 N-[(4-fluorophenyl)methyl]-5-hydroxy-1-methyl-2-{2-[2-(4-methylpiperazin-1-yl)-2-oxoacetamido]propan-2-yl}-6-oxo-1,6-dihydropyrimidine-4-carboxamide::N-methyl-pyrimidinone derivative, 16
SMILES: CN1CCN(CC1)C(=O)C(=O)NC(C)(C)c1nc(C(=O)NCc2ccc(F)cc2)c(O)c(=O)n1C
InChI Key: InChIKey=DPAFVBVGSXRSSW-UHFFFAOYSA-N
Data: 1 IC50
Activity Spreadsheet -- Enzyme Inhibition Constant Data from BindingDB
Found 1 hit for monomerid = 25340
Trg + Lig
Ki
nM
ΔG°
kcal/mole
IC50
nM
Kd
nM
EC50/IC50
nM
koff
s-1
kon
M-1s-1
pHTemp
°C
Gag-Pol polyprotein
(Human immunodeficiency virus type 1 group M subtyp...)
BDBM25340
(N-[(4-fluorophenyl)methyl]-5-hydroxy-1-methyl-2-{2...)
Show SMILES CN1CCN(CC1)C(=O)C(=O)NC(C)(C)c1nc(C(=O)NCc2ccc(F)cc2)c(O)c(=O)n1C
Show InChI InChI=1S/C23H29FN6O5/c1-23(2,27-19(33)21(35)30-11-9-28(3)10-12-30)22-26-16(17(31)20(34)29(22)4)18(32)25-13-14-5-7-15(24)8-6-14/h5-8,31H,9-13H2,1-4H3,(H,25,32)(H,27,33)
n/an/a 26n/an/an/an/a7.837
Merck Research Laboratories
Assay Description
The microtiter plate assay for stand transfer was performed with an immobilized donor substrate and a target substrate biotinylated at the 3-prime en...
J Med Chem 51: 5843-55 (2008)
Article DOI: 10.1021/jm800245z
BindingDB Entry DOI: 10.7270/Q2QJ7FMR