BDBM25344 N-[2-(4-{[(3-chloro-4-fluorophenyl)methyl]carbamoyl}-5-hydroxy-1-methyl-6-oxo-1,6-dihydropyrimidin-2-yl)propan-2-yl]-N',N'-dimethylethanediamide::N-methyl-pyrimidinone derivative, 20
SMILES: CN(C)C(=O)C(=O)NC(C)(C)c1nc(C(=O)NCc2ccc(F)c(Cl)c2)c(O)c(=O)n1C
InChI Key: InChIKey=WBRPRBQVFUBZTE-UHFFFAOYSA-N
Data: 1 IC50
Activity Spreadsheet -- Enzyme Inhibition Constant Data from BindingDB
Found 1 hit for monomerid = 25344
Trg + Lig
Ki
nM
ΔG°
kcal/mole
IC50
nM
Kd
nM
EC50/IC50
nM
koff
s-1
kon
M-1s-1
pHTemp
°C
Gag-Pol polyprotein
(Human immunodeficiency virus type 1 group M subtyp...)
BDBM25344
(N-[2-(4-{[(3-chloro-4-fluorophenyl)methyl]carbamoy...)
Show SMILES CN(C)C(=O)C(=O)NC(C)(C)c1nc(C(=O)NCc2ccc(F)c(Cl)c2)c(O)c(=O)n1C
Show InChI InChI=1S/C20H23ClFN5O5/c1-20(2,25-16(30)18(32)26(3)4)19-24-13(14(28)17(31)27(19)5)15(29)23-9-10-6-7-12(22)11(21)8-10/h6-8,28H,9H2,1-5H3,(H,23,29)(H,25,30)
n/an/a 9n/an/an/an/a7.837
Merck Research Laboratories
Assay Description
The microtiter plate assay for stand transfer was performed with an immobilized donor substrate and a target substrate biotinylated at the 3-prime en...
J Med Chem 51: 5843-55 (2008)
Article DOI: 10.1021/jm800245z
BindingDB Entry DOI: 10.7270/Q2QJ7FMR