BDBM25346 N-[2-(4-{[(4-fluorophenyl)methyl]carbamoyl}-5-hydroxy-1-methyl-6-oxo-1,6-dihydropyrimidin-2-yl)propan-2-yl]pyridazine-3-carboxamide::N-methyl-pyrimidinone derivative, 22
SMILES: Cn1c(nc(C(=O)NCc2ccc(F)cc2)c(O)c1=O)C(C)(C)NC(=O)c1cccnn1
InChI Key: InChIKey=INZUGTGTHGBOFW-UHFFFAOYSA-N
Data: 1 IC50
Activity Spreadsheet -- Enzyme Inhibition Constant Data from BindingDB
Found 1 hit for monomerid = 25346
Trg + Lig
Ki
nM
ΔG°
kcal/mole
IC50
nM
Kd
nM
EC50/IC50
nM
koff
s-1
kon
M-1s-1
pHTemp
°C
Gag-Pol polyprotein
(Human immunodeficiency virus type 1 group M subtyp...)
BDBM25346
(N-[2-(4-{[(4-fluorophenyl)methyl]carbamoyl}-5-hydr...)
Show SMILES Cn1c(nc(C(=O)NCc2ccc(F)cc2)c(O)c1=O)C(C)(C)NC(=O)c1cccnn1
Show InChI InChI=1S/C21H21FN6O4/c1-21(2,26-17(30)14-5-4-10-24-27-14)20-25-15(16(29)19(32)28(20)3)18(31)23-11-12-6-8-13(22)9-7-12/h4-10,29H,11H2,1-3H3,(H,23,31)(H,26,30)
n/an/a 15n/an/an/an/a7.837
Merck Research Laboratories
Assay Description
The microtiter plate assay for stand transfer was performed with an immobilized donor substrate and a target substrate biotinylated at the 3-prime en...
J Med Chem 51: 5843-55 (2008)
Article DOI: 10.1021/jm800245z
BindingDB Entry DOI: 10.7270/Q2QJ7FMR