BDBM25349 N-[2-(4-{[(4-fluorophenyl)methyl]carbamoyl}-5-hydroxy-1-methyl-6-oxo-1,6-dihydropyrimidin-2-yl)propan-2-yl]-1,3-thiazole-4-carboxamide::N-methyl-pyrimidinone derivative, 25
SMILES: Cn1c(nc(C(=O)NCc2ccc(F)cc2)c(O)c1=O)C(C)(C)NC(=O)c1cscn1
InChI Key: InChIKey=PXTJWPDFMVIUTB-UHFFFAOYSA-N
Data: 1 IC50
Activity Spreadsheet -- Enzyme Inhibition Constant Data from BindingDB
Found 1 hit for monomerid = 25349
Trg + Lig
Ki
nM
ΔG°
kcal/mole
IC50
nM
Kd
nM
EC50/IC50
nM
koff
s-1
kon
M-1s-1
pHTemp
°C
Gag-Pol polyprotein
(Human immunodeficiency virus type 1 group M subtyp...)
BDBM25349
(N-[2-(4-{[(4-fluorophenyl)methyl]carbamoyl}-5-hydr...)
Show SMILES Cn1c(nc(C(=O)NCc2ccc(F)cc2)c(O)c1=O)C(C)(C)NC(=O)c1cscn1
Show InChI InChI=1S/C20H20FN5O4S/c1-20(2,25-16(28)13-9-31-10-23-13)19-24-14(15(27)18(30)26(19)3)17(29)22-8-11-4-6-12(21)7-5-11/h4-7,9-10,27H,8H2,1-3H3,(H,22,29)(H,25,28)
n/an/a 8n/an/an/an/a7.837
Merck Research Laboratories
Assay Description
The microtiter plate assay for stand transfer was performed with an immobilized donor substrate and a target substrate biotinylated at the 3-prime en...
J Med Chem 51: 5843-55 (2008)
Article DOI: 10.1021/jm800245z
BindingDB Entry DOI: 10.7270/Q2QJ7FMR