BDBM25365 (5S)-1,3-dioxepan-5-yl N-[(2S,3R)-3-hydroxy-4-[(4-methoxybenzene)(2-methylpropyl)sulfonamido]-1-phenylbutan-2-yl]carbamate::(R)-(hydroxyethylamino)sulfonamide isostere, 3b
SMILES: [H][C@@]1(CCOCOC1)OC(=O)N[C@@H](Cc1ccccc1)[C@H](O)CN(CC(C)C)S(=O)(=O)c1ccc(OC)cc1
InChI Key: InChIKey=LEJNWIFUYPPOMU-AYRHNUGRSA-N
Data: 1 KI  1 IC50
Activity Spreadsheet -- Enzyme Inhibition Constant Data from BindingDB
Found 1 hit for monomerid = 25365
Trg + Lig
Ki
nM
ΔG°
kcal/mole
IC50
nM
Kd
nM
EC50/IC50
nM
koff
s-1
kon
M-1s-1
pHTemp
°C
HIV-1 Protease
(Human immunodeficiency virus type 1)
BDBM25365
((5S)-1,3-dioxepan-5-yl N-[(2S,3R)-3-hydroxy-4-[(4-...)
Show SMILES [H][C@@]1(CCOCOC1)OC(=O)N[C@@H](Cc1ccccc1)[C@H](O)CN(CC(C)C)S(=O)(=O)c1ccc(OC)cc1 |r|
Show InChI InChI=1S/C27H38N2O8S/c1-20(2)16-29(38(32,33)24-11-9-22(34-3)10-12-24)17-26(30)25(15-21-7-5-4-6-8-21)28-27(31)37-23-13-14-35-19-36-18-23/h4-12,20,23,25-26,30H,13-19H2,1-3H3,(H,28,31)/t23-,25-,26+/m0/s1
0.160 -13.4 30n/an/an/an/a6.425
Purdue University
Assay Description
The Ki values were determined by substrate cleavage assay using fluorogenic substrate, 2-(aminobenzoyl)-Thr-Ile-Nle-Phe(p-NO2)-Gln-Arg-NH2. A standar...
J Med Chem 51: 6021-33 (2008)
Article DOI: 10.1021/jm8004543
BindingDB Entry DOI: 10.7270/Q2G15Z51