BDBM25369 (4S)-oxepan-4-yl N-[(2S,3R)-3-hydroxy-4-[(4-methoxybenzene)(2-methylpropyl)sulfonamido]-1-phenylbutan-2-yl]carbamate::(R)-(hydroxyethylamino)sulfonamide isostere, 3f
SMILES: [H][C@@]1(CCCOCC1)OC(=O)N[C@@H](Cc1ccccc1)[C@H](O)CN(CC(C)C)S(=O)(=O)c1ccc(OC)cc1
InChI Key: InChIKey=NUZLDHGOBUOVBV-DOEKTCAHSA-N
Data: 1 KI
Activity Spreadsheet -- Enzyme Inhibition Constant Data from BindingDB
Found 1 hit for monomerid = 25369
Trg + Lig
Ki
nM
ΔG°
kcal/mole
IC50
nM
Kd
nM
EC50/IC50
nM
koff
s-1
kon
M-1s-1
pHTemp
°C
HIV-1 Protease
(Human immunodeficiency virus type 1)
BDBM25369
((4S)-oxepan-4-yl N-[(2S,3R)-3-hydroxy-4-[(4-methox...)
Show SMILES [H][C@@]1(CCCOCC1)OC(=O)N[C@@H](Cc1ccccc1)[C@H](O)CN(CC(C)C)S(=O)(=O)c1ccc(OC)cc1 |r|
Show InChI InChI=1S/C28H40N2O7S/c1-21(2)19-30(38(33,34)25-13-11-23(35-3)12-14-25)20-27(31)26(18-22-8-5-4-6-9-22)29-28(32)37-24-10-7-16-36-17-15-24/h4-6,8-9,11-14,21,24,26-27,31H,7,10,15-20H2,1-3H3,(H,29,32)/t24-,26-,27+/m0/s1
0.740 -12.4n/an/an/an/an/a6.425
Purdue University
Assay Description
The Ki values were determined by substrate cleavage assay using fluorogenic substrate, 2-(aminobenzoyl)-Thr-Ile-Nle-Phe(p-NO2)-Gln-Arg-NH2. A standar...
J Med Chem 51: 6021-33 (2008)
Article DOI: 10.1021/jm8004543
BindingDB Entry DOI: 10.7270/Q2G15Z51