null
SMILES: CN[C@@H](C)C(=O)Nc1ccc(-c2c(nc3cc(C)ccn23)-c2ccnc(OC)c2)c(n1)C#Cc1ccc2c(C)nccc2c1
InChI Key: InChIKey=DOCWUWPIDUHYPB-QHCPKHFHSA-N
Activity Spreadsheet -- Enzyme Inhibition Constant Data from BindingDB
Found 7 hits for monomerid = 253998
Trg + Lig
Ki
nM
ΔG°
kcal/mole
IC50
nM
Kd
nM
EC50/IC50
nM
koff
s-1
kon
M-1s-1
pHTemp
°C
Baculoviral IAP repeat-containing protein 2 [256-363]
(Homo sapiens (Human))
BDBM253998
(US9481673, (S)-8)
Show SMILES CN[C@@H](C)C(=O)Nc1ccc(-c2c(nc3cc(C)ccn23)-c2ccnc(OC)c2)c(n1)C#Cc1ccc2c(C)nccc2c1 |r,wU:2.2,(-6,-3.76,;-7.34,-2.99,;-7.34,-1.45,;-8.67,-.68,;-6,-.68,;-6,.86,;-4.67,-1.45,;-3.33,-.68,;-3.33,.86,;-2,1.63,;-.67,.86,;.67,1.63,;.67,3.17,;2.13,3.65,;3.04,2.4,;4.57,2.24,;5.19,.83,;6.68,.44,;4.29,-.41,;2.76,-.25,;2.13,1.16,;-.42,4.26,;-.02,5.75,;-1.11,6.84,;-2.6,6.44,;-3,4.95,;-4.49,4.55,;-5.57,5.64,;-1.91,3.86,;-.67,-.68,;-2,-1.45,;.67,-1.45,;2,-2.22,;3.33,-2.99,;3.33,-4.53,;4.67,-5.3,;6,-4.53,;7.34,-5.3,;7.34,-6.84,;8.67,-4.53,;8.67,-2.99,;7.34,-2.22,;6,-2.99,;4.67,-2.22,)|
Show InChI InChI=1S/C35H31N7O2/c1-21-14-17-42-31(18-21)41-33(26-13-16-38-32(20-26)44-5)34(42)28-9-11-30(40-35(43)23(3)36-4)39-29(28)10-7-24-6-8-27-22(2)37-15-12-25(27)19-24/h6,8-9,11-20,23,36H,1-5H3,(H,39,40,43)/t23-/m0/s1
US Patent
n/an/a 1n/an/an/an/an/a25
Boehringer ingelheim International GmbH
US Patent
Assay Description
BIR3 domains (10 nM) were incubated with SMAC peptide (10 nM) in assay buffer (50 mM Tris, 120 mM NaCl, 0.1% BSA, 1 mM DTT, 0.05% Triton X100) for on...
US Patent US9481673 (2016)
BindingDB Entry DOI: 10.7270/Q24M93G0
E3 ubiquitin-protein ligase XIAP [241-356]
(Homo sapiens (Human))
BDBM253998
(US9481673, (S)-8)
Show SMILES CN[C@@H](C)C(=O)Nc1ccc(-c2c(nc3cc(C)ccn23)-c2ccnc(OC)c2)c(n1)C#Cc1ccc2c(C)nccc2c1 |r,wU:2.2,(-6,-3.76,;-7.34,-2.99,;-7.34,-1.45,;-8.67,-.68,;-6,-.68,;-6,.86,;-4.67,-1.45,;-3.33,-.68,;-3.33,.86,;-2,1.63,;-.67,.86,;.67,1.63,;.67,3.17,;2.13,3.65,;3.04,2.4,;4.57,2.24,;5.19,.83,;6.68,.44,;4.29,-.41,;2.76,-.25,;2.13,1.16,;-.42,4.26,;-.02,5.75,;-1.11,6.84,;-2.6,6.44,;-3,4.95,;-4.49,4.55,;-5.57,5.64,;-1.91,3.86,;-.67,-.68,;-2,-1.45,;.67,-1.45,;2,-2.22,;3.33,-2.99,;3.33,-4.53,;4.67,-5.3,;6,-4.53,;7.34,-5.3,;7.34,-6.84,;8.67,-4.53,;8.67,-2.99,;7.34,-2.22,;6,-2.99,;4.67,-2.22,)|
Show InChI InChI=1S/C35H31N7O2/c1-21-14-17-42-31(18-21)41-33(26-13-16-38-32(20-26)44-5)34(42)28-9-11-30(40-35(43)23(3)36-4)39-29(28)10-7-24-6-8-27-22(2)37-15-12-25(27)19-24/h6,8-9,11-20,23,36H,1-5H3,(H,39,40,43)/t23-/m0/s1
Reactome pathway
US Patent
n/an/a 147n/an/an/an/an/a25
Boehringer ingelheim International GmbH
US Patent
Assay Description
BIR3 domains (10 nM) were incubated with SMAC peptide (10 nM) in assay buffer (50 mM Tris, 120 mM NaCl, 0.1% BSA, 1 mM DTT, 0.05% Triton X100) for on...
US Patent US9481673 (2016)
BindingDB Entry DOI: 10.7270/Q24M93G0
Cytochrome P450 2C19
(Homo sapiens (Human))
BDBM253998
(US9481673, (S)-8)
Show SMILES CN[C@@H](C)C(=O)Nc1ccc(-c2c(nc3cc(C)ccn23)-c2ccnc(OC)c2)c(n1)C#Cc1ccc2c(C)nccc2c1 |r,wU:2.2,(-6,-3.76,;-7.34,-2.99,;-7.34,-1.45,;-8.67,-.68,;-6,-.68,;-6,.86,;-4.67,-1.45,;-3.33,-.68,;-3.33,.86,;-2,1.63,;-.67,.86,;.67,1.63,;.67,3.17,;2.13,3.65,;3.04,2.4,;4.57,2.24,;5.19,.83,;6.68,.44,;4.29,-.41,;2.76,-.25,;2.13,1.16,;-.42,4.26,;-.02,5.75,;-1.11,6.84,;-2.6,6.44,;-3,4.95,;-4.49,4.55,;-5.57,5.64,;-1.91,3.86,;-.67,-.68,;-2,-1.45,;.67,-1.45,;2,-2.22,;3.33,-2.99,;3.33,-4.53,;4.67,-5.3,;6,-4.53,;7.34,-5.3,;7.34,-6.84,;8.67,-4.53,;8.67,-2.99,;7.34,-2.22,;6,-2.99,;4.67,-2.22,)|
Show InChI InChI=1S/C35H31N7O2/c1-21-14-17-42-31(18-21)41-33(26-13-16-38-32(20-26)44-5)34(42)28-9-11-30(40-35(43)23(3)36-4)39-29(28)10-7-24-6-8-27-22(2)37-15-12-25(27)19-24/h6,8-9,11-20,23,36H,1-5H3,(H,39,40,43)/t23-/m0/s1
Reactome pathway
US Patent
n/an/a 3.80E+4n/an/an/an/an/an/a
Boehringer ingelheim International GmbH
US Patent
Assay Description
The final incubation volume contains TRIS buffer (0.1 M), MgCl2 (5 mM), a certain concentration of human liver microsomes dependent on the P450 isoen...
US Patent US9481673 (2016)
BindingDB Entry DOI: 10.7270/Q24M93G0
Cytochrome P450 3A4
(Homo sapiens (Human))
BDBM253998
(US9481673, (S)-8)
Show SMILES CN[C@@H](C)C(=O)Nc1ccc(-c2c(nc3cc(C)ccn23)-c2ccnc(OC)c2)c(n1)C#Cc1ccc2c(C)nccc2c1 |r,wU:2.2,(-6,-3.76,;-7.34,-2.99,;-7.34,-1.45,;-8.67,-.68,;-6,-.68,;-6,.86,;-4.67,-1.45,;-3.33,-.68,;-3.33,.86,;-2,1.63,;-.67,.86,;.67,1.63,;.67,3.17,;2.13,3.65,;3.04,2.4,;4.57,2.24,;5.19,.83,;6.68,.44,;4.29,-.41,;2.76,-.25,;2.13,1.16,;-.42,4.26,;-.02,5.75,;-1.11,6.84,;-2.6,6.44,;-3,4.95,;-4.49,4.55,;-5.57,5.64,;-1.91,3.86,;-.67,-.68,;-2,-1.45,;.67,-1.45,;2,-2.22,;3.33,-2.99,;3.33,-4.53,;4.67,-5.3,;6,-4.53,;7.34,-5.3,;7.34,-6.84,;8.67,-4.53,;8.67,-2.99,;7.34,-2.22,;6,-2.99,;4.67,-2.22,)|
Show InChI InChI=1S/C35H31N7O2/c1-21-14-17-42-31(18-21)41-33(26-13-16-38-32(20-26)44-5)34(42)28-9-11-30(40-35(43)23(3)36-4)39-29(28)10-7-24-6-8-27-22(2)37-15-12-25(27)19-24/h6,8-9,11-20,23,36H,1-5H3,(H,39,40,43)/t23-/m0/s1
Reactome pathway
US Patent
n/an/a>5.00E+4n/an/an/an/an/an/a
Boehringer ingelheim International GmbH
US Patent
Assay Description
The final incubation volume contains TRIS buffer (0.1 M), MgCl2 (5 mM), a certain concentration of human liver microsomes dependent on the P450 isoen...
US Patent US9481673 (2016)
BindingDB Entry DOI: 10.7270/Q24M93G0
Cytochrome P450 2C9
(Homo sapiens (Human))
BDBM253998
(US9481673, (S)-8)
Show SMILES CN[C@@H](C)C(=O)Nc1ccc(-c2c(nc3cc(C)ccn23)-c2ccnc(OC)c2)c(n1)C#Cc1ccc2c(C)nccc2c1 |r,wU:2.2,(-6,-3.76,;-7.34,-2.99,;-7.34,-1.45,;-8.67,-.68,;-6,-.68,;-6,.86,;-4.67,-1.45,;-3.33,-.68,;-3.33,.86,;-2,1.63,;-.67,.86,;.67,1.63,;.67,3.17,;2.13,3.65,;3.04,2.4,;4.57,2.24,;5.19,.83,;6.68,.44,;4.29,-.41,;2.76,-.25,;2.13,1.16,;-.42,4.26,;-.02,5.75,;-1.11,6.84,;-2.6,6.44,;-3,4.95,;-4.49,4.55,;-5.57,5.64,;-1.91,3.86,;-.67,-.68,;-2,-1.45,;.67,-1.45,;2,-2.22,;3.33,-2.99,;3.33,-4.53,;4.67,-5.3,;6,-4.53,;7.34,-5.3,;7.34,-6.84,;8.67,-4.53,;8.67,-2.99,;7.34,-2.22,;6,-2.99,;4.67,-2.22,)|
Show InChI InChI=1S/C35H31N7O2/c1-21-14-17-42-31(18-21)41-33(26-13-16-38-32(20-26)44-5)34(42)28-9-11-30(40-35(43)23(3)36-4)39-29(28)10-7-24-6-8-27-22(2)37-15-12-25(27)19-24/h6,8-9,11-20,23,36H,1-5H3,(H,39,40,43)/t23-/m0/s1
Reactome pathway
US Patent
n/an/a>5.00E+4n/an/an/an/an/an/a
Boehringer ingelheim International GmbH
US Patent
Assay Description
The final incubation volume contains TRIS buffer (0.1 M), MgCl2 (5 mM), a certain concentration of human liver microsomes dependent on the P450 isoen...
US Patent US9481673 (2016)
BindingDB Entry DOI: 10.7270/Q24M93G0
Cytochrome P450 2D6
(Homo sapiens (Human))
BDBM253998
(US9481673, (S)-8)
Show SMILES CN[C@@H](C)C(=O)Nc1ccc(-c2c(nc3cc(C)ccn23)-c2ccnc(OC)c2)c(n1)C#Cc1ccc2c(C)nccc2c1 |r,wU:2.2,(-6,-3.76,;-7.34,-2.99,;-7.34,-1.45,;-8.67,-.68,;-6,-.68,;-6,.86,;-4.67,-1.45,;-3.33,-.68,;-3.33,.86,;-2,1.63,;-.67,.86,;.67,1.63,;.67,3.17,;2.13,3.65,;3.04,2.4,;4.57,2.24,;5.19,.83,;6.68,.44,;4.29,-.41,;2.76,-.25,;2.13,1.16,;-.42,4.26,;-.02,5.75,;-1.11,6.84,;-2.6,6.44,;-3,4.95,;-4.49,4.55,;-5.57,5.64,;-1.91,3.86,;-.67,-.68,;-2,-1.45,;.67,-1.45,;2,-2.22,;3.33,-2.99,;3.33,-4.53,;4.67,-5.3,;6,-4.53,;7.34,-5.3,;7.34,-6.84,;8.67,-4.53,;8.67,-2.99,;7.34,-2.22,;6,-2.99,;4.67,-2.22,)|
Show InChI InChI=1S/C35H31N7O2/c1-21-14-17-42-31(18-21)41-33(26-13-16-38-32(20-26)44-5)34(42)28-9-11-30(40-35(43)23(3)36-4)39-29(28)10-7-24-6-8-27-22(2)37-15-12-25(27)19-24/h6,8-9,11-20,23,36H,1-5H3,(H,39,40,43)/t23-/m0/s1
US Patent
n/an/a>5.00E+4n/an/an/an/an/an/a
Boehringer ingelheim International GmbH
US Patent
Assay Description
The final incubation volume contains TRIS buffer (0.1 M), MgCl2 (5 mM), a certain concentration of human liver microsomes dependent on the P450 isoen...
US Patent US9481673 (2016)
BindingDB Entry DOI: 10.7270/Q24M93G0
Cytochrome P450 2C8
(Homo sapiens (Human))
BDBM253998
(US9481673, (S)-8)
Show SMILES CN[C@@H](C)C(=O)Nc1ccc(-c2c(nc3cc(C)ccn23)-c2ccnc(OC)c2)c(n1)C#Cc1ccc2c(C)nccc2c1 |r,wU:2.2,(-6,-3.76,;-7.34,-2.99,;-7.34,-1.45,;-8.67,-.68,;-6,-.68,;-6,.86,;-4.67,-1.45,;-3.33,-.68,;-3.33,.86,;-2,1.63,;-.67,.86,;.67,1.63,;.67,3.17,;2.13,3.65,;3.04,2.4,;4.57,2.24,;5.19,.83,;6.68,.44,;4.29,-.41,;2.76,-.25,;2.13,1.16,;-.42,4.26,;-.02,5.75,;-1.11,6.84,;-2.6,6.44,;-3,4.95,;-4.49,4.55,;-5.57,5.64,;-1.91,3.86,;-.67,-.68,;-2,-1.45,;.67,-1.45,;2,-2.22,;3.33,-2.99,;3.33,-4.53,;4.67,-5.3,;6,-4.53,;7.34,-5.3,;7.34,-6.84,;8.67,-4.53,;8.67,-2.99,;7.34,-2.22,;6,-2.99,;4.67,-2.22,)|
Show InChI InChI=1S/C35H31N7O2/c1-21-14-17-42-31(18-21)41-33(26-13-16-38-32(20-26)44-5)34(42)28-9-11-30(40-35(43)23(3)36-4)39-29(28)10-7-24-6-8-27-22(2)37-15-12-25(27)19-24/h6,8-9,11-20,23,36H,1-5H3,(H,39,40,43)/t23-/m0/s1
US Patent
n/an/a 1.60E+3n/an/an/an/an/an/a
Boehringer ingelheim International GmbH
US Patent
Assay Description
The final incubation volume contains TRIS buffer (0.1 M), MgCl2 (5 mM), a certain concentration of human liver microsomes dependent on the P450 isoen...
US Patent US9481673 (2016)
BindingDB Entry DOI: 10.7270/Q24M93G0