BDBM254001 US9481673, (S)-11
SMILES: CN[C@@H](C)C(=O)Nc1ccc(-c2c(nc3cc(C)ccn23)-c2ccnc(C)c2)c(n1)C#Cc1ccccc1
InChI Key: InChIKey=RVXKLPGEBCDTMK-QFIPXVFZSA-N
Data: 7 IC50
Activity Spreadsheet -- Enzyme Inhibition Constant Data from BindingDB
Found 7 hits for monomerid = 254001
Trg + Lig
Ki
nM
ΔG°
kcal/mole
IC50
nM
Kd
nM
EC50/IC50
nM
koff
s-1
kon
M-1s-1
pHTemp
°C
Baculoviral IAP repeat-containing protein 2 [256-363]
(Homo sapiens (Human))
BDBM254001
(US9481673, (S)-11)
Show SMILES CN[C@@H](C)C(=O)Nc1ccc(-c2c(nc3cc(C)ccn23)-c2ccnc(C)c2)c(n1)C#Cc1ccccc1 |r,wU:2.2,(-5.01,-4.53,;-6.34,-3.76,;-6.34,-2.22,;-7.68,-1.45,;-5.01,-1.45,;-5.01,.09,;-3.67,-2.22,;-2.34,-1.45,;-2.34,.09,;-1.01,.86,;.33,.09,;1.66,.86,;1.66,2.4,;3.12,2.88,;4.03,1.63,;5.56,1.47,;6.19,.06,;7.68,-.33,;5.28,-1.18,;3.75,-1.02,;3.12,.39,;.57,3.49,;.97,4.98,;-.12,6.07,;-1.61,5.67,;-2.01,4.18,;-3.49,3.78,;-.92,3.09,;.33,-1.45,;-1.01,-2.22,;1.66,-2.22,;2.99,-2.99,;4.33,-3.76,;4.33,-5.3,;5.66,-6.07,;6.99,-5.3,;6.99,-3.76,;5.66,-2.99,)|
Show InChI InChI=1S/C31H28N6O/c1-20-15-17-37-28(18-20)36-29(24-14-16-33-21(2)19-24)30(37)25-11-13-27(35-31(38)22(3)32-4)34-26(25)12-10-23-8-6-5-7-9-23/h5-9,11,13-19,22,32H,1-4H3,(H,34,35,38)/t22-/m0/s1
US Patent
n/an/a 1n/an/an/an/an/a25
Boehringer ingelheim International GmbH
US Patent
Assay Description
BIR3 domains (10 nM) were incubated with SMAC peptide (10 nM) in assay buffer (50 mM Tris, 120 mM NaCl, 0.1% BSA, 1 mM DTT, 0.05% Triton X100) for on...
US Patent US9481673 (2016)
BindingDB Entry DOI: 10.7270/Q24M93G0
E3 ubiquitin-protein ligase XIAP [241-356]
(Homo sapiens (Human))
BDBM254001
(US9481673, (S)-11)
Show SMILES CN[C@@H](C)C(=O)Nc1ccc(-c2c(nc3cc(C)ccn23)-c2ccnc(C)c2)c(n1)C#Cc1ccccc1 |r,wU:2.2,(-5.01,-4.53,;-6.34,-3.76,;-6.34,-2.22,;-7.68,-1.45,;-5.01,-1.45,;-5.01,.09,;-3.67,-2.22,;-2.34,-1.45,;-2.34,.09,;-1.01,.86,;.33,.09,;1.66,.86,;1.66,2.4,;3.12,2.88,;4.03,1.63,;5.56,1.47,;6.19,.06,;7.68,-.33,;5.28,-1.18,;3.75,-1.02,;3.12,.39,;.57,3.49,;.97,4.98,;-.12,6.07,;-1.61,5.67,;-2.01,4.18,;-3.49,3.78,;-.92,3.09,;.33,-1.45,;-1.01,-2.22,;1.66,-2.22,;2.99,-2.99,;4.33,-3.76,;4.33,-5.3,;5.66,-6.07,;6.99,-5.3,;6.99,-3.76,;5.66,-2.99,)|
Show InChI InChI=1S/C31H28N6O/c1-20-15-17-37-28(18-20)36-29(24-14-16-33-21(2)19-24)30(37)25-11-13-27(35-31(38)22(3)32-4)34-26(25)12-10-23-8-6-5-7-9-23/h5-9,11,13-19,22,32H,1-4H3,(H,34,35,38)/t22-/m0/s1
Reactome pathway
US Patent
n/an/a 13n/an/an/an/an/a25
Boehringer ingelheim International GmbH
US Patent
Assay Description
BIR3 domains (10 nM) were incubated with SMAC peptide (10 nM) in assay buffer (50 mM Tris, 120 mM NaCl, 0.1% BSA, 1 mM DTT, 0.05% Triton X100) for on...
US Patent US9481673 (2016)
BindingDB Entry DOI: 10.7270/Q24M93G0
Cytochrome P450 2C19
(Homo sapiens (Human))
BDBM254001
(US9481673, (S)-11)
Show SMILES CN[C@@H](C)C(=O)Nc1ccc(-c2c(nc3cc(C)ccn23)-c2ccnc(C)c2)c(n1)C#Cc1ccccc1 |r,wU:2.2,(-5.01,-4.53,;-6.34,-3.76,;-6.34,-2.22,;-7.68,-1.45,;-5.01,-1.45,;-5.01,.09,;-3.67,-2.22,;-2.34,-1.45,;-2.34,.09,;-1.01,.86,;.33,.09,;1.66,.86,;1.66,2.4,;3.12,2.88,;4.03,1.63,;5.56,1.47,;6.19,.06,;7.68,-.33,;5.28,-1.18,;3.75,-1.02,;3.12,.39,;.57,3.49,;.97,4.98,;-.12,6.07,;-1.61,5.67,;-2.01,4.18,;-3.49,3.78,;-.92,3.09,;.33,-1.45,;-1.01,-2.22,;1.66,-2.22,;2.99,-2.99,;4.33,-3.76,;4.33,-5.3,;5.66,-6.07,;6.99,-5.3,;6.99,-3.76,;5.66,-2.99,)|
Show InChI InChI=1S/C31H28N6O/c1-20-15-17-37-28(18-20)36-29(24-14-16-33-21(2)19-24)30(37)25-11-13-27(35-31(38)22(3)32-4)34-26(25)12-10-23-8-6-5-7-9-23/h5-9,11,13-19,22,32H,1-4H3,(H,34,35,38)/t22-/m0/s1
Reactome pathway
US Patent
n/an/a 1.40E+4n/an/an/an/an/an/a
Boehringer ingelheim International GmbH
US Patent
Assay Description
The final incubation volume contains TRIS buffer (0.1 M), MgCl2 (5 mM), a certain concentration of human liver microsomes dependent on the P450 isoen...
US Patent US9481673 (2016)
BindingDB Entry DOI: 10.7270/Q24M93G0
Cytochrome P450 3A4
(Homo sapiens (Human))
BDBM254001
(US9481673, (S)-11)
Show SMILES CN[C@@H](C)C(=O)Nc1ccc(-c2c(nc3cc(C)ccn23)-c2ccnc(C)c2)c(n1)C#Cc1ccccc1 |r,wU:2.2,(-5.01,-4.53,;-6.34,-3.76,;-6.34,-2.22,;-7.68,-1.45,;-5.01,-1.45,;-5.01,.09,;-3.67,-2.22,;-2.34,-1.45,;-2.34,.09,;-1.01,.86,;.33,.09,;1.66,.86,;1.66,2.4,;3.12,2.88,;4.03,1.63,;5.56,1.47,;6.19,.06,;7.68,-.33,;5.28,-1.18,;3.75,-1.02,;3.12,.39,;.57,3.49,;.97,4.98,;-.12,6.07,;-1.61,5.67,;-2.01,4.18,;-3.49,3.78,;-.92,3.09,;.33,-1.45,;-1.01,-2.22,;1.66,-2.22,;2.99,-2.99,;4.33,-3.76,;4.33,-5.3,;5.66,-6.07,;6.99,-5.3,;6.99,-3.76,;5.66,-2.99,)|
Show InChI InChI=1S/C31H28N6O/c1-20-15-17-37-28(18-20)36-29(24-14-16-33-21(2)19-24)30(37)25-11-13-27(35-31(38)22(3)32-4)34-26(25)12-10-23-8-6-5-7-9-23/h5-9,11,13-19,22,32H,1-4H3,(H,34,35,38)/t22-/m0/s1
Reactome pathway
US Patent
n/an/a 4.60E+4n/an/an/an/an/an/a
Boehringer ingelheim International GmbH
US Patent
Assay Description
The final incubation volume contains TRIS buffer (0.1 M), MgCl2 (5 mM), a certain concentration of human liver microsomes dependent on the P450 isoen...
US Patent US9481673 (2016)
BindingDB Entry DOI: 10.7270/Q24M93G0
Cytochrome P450 2C9
(Homo sapiens (Human))
BDBM254001
(US9481673, (S)-11)
Show SMILES CN[C@@H](C)C(=O)Nc1ccc(-c2c(nc3cc(C)ccn23)-c2ccnc(C)c2)c(n1)C#Cc1ccccc1 |r,wU:2.2,(-5.01,-4.53,;-6.34,-3.76,;-6.34,-2.22,;-7.68,-1.45,;-5.01,-1.45,;-5.01,.09,;-3.67,-2.22,;-2.34,-1.45,;-2.34,.09,;-1.01,.86,;.33,.09,;1.66,.86,;1.66,2.4,;3.12,2.88,;4.03,1.63,;5.56,1.47,;6.19,.06,;7.68,-.33,;5.28,-1.18,;3.75,-1.02,;3.12,.39,;.57,3.49,;.97,4.98,;-.12,6.07,;-1.61,5.67,;-2.01,4.18,;-3.49,3.78,;-.92,3.09,;.33,-1.45,;-1.01,-2.22,;1.66,-2.22,;2.99,-2.99,;4.33,-3.76,;4.33,-5.3,;5.66,-6.07,;6.99,-5.3,;6.99,-3.76,;5.66,-2.99,)|
Show InChI InChI=1S/C31H28N6O/c1-20-15-17-37-28(18-20)36-29(24-14-16-33-21(2)19-24)30(37)25-11-13-27(35-31(38)22(3)32-4)34-26(25)12-10-23-8-6-5-7-9-23/h5-9,11,13-19,22,32H,1-4H3,(H,34,35,38)/t22-/m0/s1
Reactome pathway
US Patent
n/an/a>5.00E+4n/an/an/an/an/an/a
Boehringer ingelheim International GmbH
US Patent
Assay Description
The final incubation volume contains TRIS buffer (0.1 M), MgCl2 (5 mM), a certain concentration of human liver microsomes dependent on the P450 isoen...
US Patent US9481673 (2016)
BindingDB Entry DOI: 10.7270/Q24M93G0
Cytochrome P450 2D6
(Homo sapiens (Human))
BDBM254001
(US9481673, (S)-11)
Show SMILES CN[C@@H](C)C(=O)Nc1ccc(-c2c(nc3cc(C)ccn23)-c2ccnc(C)c2)c(n1)C#Cc1ccccc1 |r,wU:2.2,(-5.01,-4.53,;-6.34,-3.76,;-6.34,-2.22,;-7.68,-1.45,;-5.01,-1.45,;-5.01,.09,;-3.67,-2.22,;-2.34,-1.45,;-2.34,.09,;-1.01,.86,;.33,.09,;1.66,.86,;1.66,2.4,;3.12,2.88,;4.03,1.63,;5.56,1.47,;6.19,.06,;7.68,-.33,;5.28,-1.18,;3.75,-1.02,;3.12,.39,;.57,3.49,;.97,4.98,;-.12,6.07,;-1.61,5.67,;-2.01,4.18,;-3.49,3.78,;-.92,3.09,;.33,-1.45,;-1.01,-2.22,;1.66,-2.22,;2.99,-2.99,;4.33,-3.76,;4.33,-5.3,;5.66,-6.07,;6.99,-5.3,;6.99,-3.76,;5.66,-2.99,)|
Show InChI InChI=1S/C31H28N6O/c1-20-15-17-37-28(18-20)36-29(24-14-16-33-21(2)19-24)30(37)25-11-13-27(35-31(38)22(3)32-4)34-26(25)12-10-23-8-6-5-7-9-23/h5-9,11,13-19,22,32H,1-4H3,(H,34,35,38)/t22-/m0/s1
US Patent
n/an/a 3.20E+4n/an/an/an/an/an/a
Boehringer ingelheim International GmbH
US Patent
Assay Description
The final incubation volume contains TRIS buffer (0.1 M), MgCl2 (5 mM), a certain concentration of human liver microsomes dependent on the P450 isoen...
US Patent US9481673 (2016)
BindingDB Entry DOI: 10.7270/Q24M93G0
Cytochrome P450 2C8
(Homo sapiens (Human))
BDBM254001
(US9481673, (S)-11)
Show SMILES CN[C@@H](C)C(=O)Nc1ccc(-c2c(nc3cc(C)ccn23)-c2ccnc(C)c2)c(n1)C#Cc1ccccc1 |r,wU:2.2,(-5.01,-4.53,;-6.34,-3.76,;-6.34,-2.22,;-7.68,-1.45,;-5.01,-1.45,;-5.01,.09,;-3.67,-2.22,;-2.34,-1.45,;-2.34,.09,;-1.01,.86,;.33,.09,;1.66,.86,;1.66,2.4,;3.12,2.88,;4.03,1.63,;5.56,1.47,;6.19,.06,;7.68,-.33,;5.28,-1.18,;3.75,-1.02,;3.12,.39,;.57,3.49,;.97,4.98,;-.12,6.07,;-1.61,5.67,;-2.01,4.18,;-3.49,3.78,;-.92,3.09,;.33,-1.45,;-1.01,-2.22,;1.66,-2.22,;2.99,-2.99,;4.33,-3.76,;4.33,-5.3,;5.66,-6.07,;6.99,-5.3,;6.99,-3.76,;5.66,-2.99,)|
Show InChI InChI=1S/C31H28N6O/c1-20-15-17-37-28(18-20)36-29(24-14-16-33-21(2)19-24)30(37)25-11-13-27(35-31(38)22(3)32-4)34-26(25)12-10-23-8-6-5-7-9-23/h5-9,11,13-19,22,32H,1-4H3,(H,34,35,38)/t22-/m0/s1
US Patent
n/an/a 1.50E+4n/an/an/an/an/an/a
Boehringer ingelheim International GmbH
US Patent
Assay Description
The final incubation volume contains TRIS buffer (0.1 M), MgCl2 (5 mM), a certain concentration of human liver microsomes dependent on the P450 isoen...
US Patent US9481673 (2016)
BindingDB Entry DOI: 10.7270/Q24M93G0