null
SMILES: Oc1cc(ccc1Oc1ccc(Cl)cc1Cl)-c1ccc(F)cc1
InChI Key: InChIKey=LFNMTUYVBXAAKI-UHFFFAOYSA-N
Activity Spreadsheet -- Enzyme Inhibition Constant Data from BindingDB
Found 1 hit for monomerid = 25418
Trg + Lig
Ki
nM
ΔG°
kcal/mole
IC50
nM
Kd
nM
EC50/IC50
nM
koff
s-1
kon
M-1s-1
pHTemp
°C
Enoyl-ACP reductase
(Plasmodium falciparum)
BDBM25418
(2-(2,4-dichlorophenoxy)-5-(4-fluorophenyl)phenol |...)
Show SMILES Oc1cc(ccc1Oc1ccc(Cl)cc1Cl)-c1ccc(F)cc1
Show InChI InChI=1S/C18H11Cl2FO2/c19-13-4-8-17(15(20)10-13)23-18-7-3-12(9-16(18)22)11-1-5-14(21)6-2-11/h1-10,22H
n/an/a 38n/an/an/an/a7.925
Jacobus Pharmaceutical Company
Assay Description
PfENR inhibition assays were carried out on a Cary 100 Bio Spectrophotometer or POLARstar Optima by monitoring oxidation of NADH at 340 nm. The IC50 ...
J Biol Chem 282: 25436-44 (2007)
Article DOI: 10.1074/jbc.M701813200
BindingDB Entry DOI: 10.7270/Q22V2DFD