null
SMILES: Oc1cc(CCc2ccccc2)ccc1Oc1ccc(Cl)cc1Cl
InChI Key: InChIKey=SOSAEWQXZFTNAQ-UHFFFAOYSA-N
PDB links: 1 PDB ID matches this monomer.
Activity Spreadsheet -- Enzyme Inhibition Constant Data from BindingDB
Found 3 hits for monomerid = 25420
Trg + Lig
Ki
nM
ΔG°
kcal/mole
IC50
nM
Kd
nM
EC50/IC50
nM
koff
s-1
kon
M-1s-1
pHTemp
°C
Enoyl-ACP reductase
(Plasmodium falciparum)
BDBM25420
(2-(2,4-dichlorophenoxy)-5-(2-phenylethyl)phenol | ...)
Show SMILES Oc1cc(CCc2ccccc2)ccc1Oc1ccc(Cl)cc1Cl
Show InChI InChI=1S/C20H16Cl2O2/c21-16-9-11-19(17(22)13-16)24-20-10-8-15(12-18(20)23)7-6-14-4-2-1-3-5-14/h1-5,8-13,23H,6-7H2
n/an/a 76n/an/an/an/a7.925
Jacobus Pharmaceutical Company
Assay Description
PfENR inhibition assays were carried out on a Cary 100 Bio Spectrophotometer or POLARstar Optima by monitoring oxidation of NADH at 340 nm. The IC50 ...
J Biol Chem 282: 25436-44 (2007)
Article DOI: 10.1074/jbc.M701813200
BindingDB Entry DOI: 10.7270/Q22V2DFD
3D
3D Structure (crystal)
Enoyl-[acyl-carrier-protein] reductase [NADH]
(Mycobacterium tuberculosis (strain ATCC 25618 / H3...)
BDBM25420
(2-(2,4-dichlorophenoxy)-5-(2-phenylethyl)phenol | ...)
Show SMILES Oc1cc(CCc2ccccc2)ccc1Oc1ccc(Cl)cc1Cl
Show InChI InChI=1S/C20H16Cl2O2/c21-16-9-11-19(17(22)13-16)24-20-10-8-15(12-18(20)23)7-6-14-4-2-1-3-5-14/h1-5,8-13,23H,6-7H2
n/an/a 21n/an/an/an/an/an/a
CNRS
Curated by ChEMBL
Assay Description
Inhibition of Mycobacterium tuberculosis InhA
Eur J Med Chem 146: 318-343 (2018)
Article DOI: 10.1016/j.ejmech.2018.01.047
BindingDB Entry DOI: 10.7270/Q2GF0X12
Enoyl-acyl-carrier protein reductase
(Plasmodium falciparum)
BDBM25420
(2-(2,4-dichlorophenoxy)-5-(2-phenylethyl)phenol | ...)
Show SMILES Oc1cc(CCc2ccccc2)ccc1Oc1ccc(Cl)cc1Cl
Show InChI InChI=1S/C20H16Cl2O2/c21-16-9-11-19(17(22)13-16)24-20-10-8-15(12-18(20)23)7-6-14-4-2-1-3-5-14/h1-5,8-13,23H,6-7H2
n/an/a 76n/an/an/an/an/an/a
International Centre for Science and High Technology
Curated by ChEMBL
Assay Description
Inhibition of Plasmodium falciparum enoyl-acyl carrier protein reductase
Eur J Med Chem 44: 3009-19 (2009)
Article DOI: 10.1016/j.ejmech.2008.12.028
BindingDB Entry DOI: 10.7270/Q20K28MM
3D
3D Structure (crystal)