BDBM254589 US9469597, 48::US9670136, 48 N-(4′-((trans)-2-((4-aminocyclohexyl)amino)cyclopropyl)-6-methoxy-[1,1′-biphenyl]-3-yl)methanesulfonamide
SMILES: COc1ccc(NS(C)(=O)=O)cc1-c1ccc(cc1)[C@H]1C[C@@H]1NC1CCC(N)CC1
InChI Key: InChIKey=IJWYHMIMXOCAJF-WJTCQHJGSA-N
Data: 6 IC50
Activity Spreadsheet -- Enzyme Inhibition Constant Data from BindingDB
Found 6 hits for monomerid = 254589
Trg + Lig
Ki
nM
ΔG°
kcal/mole
IC50
nM
Kd
nM
EC50/IC50
nM
koff
s-1
kon
M-1s-1
pHTemp
°C
Amine oxidase (flavin-containing) A
(Homo sapiens (Human))
BDBM254589
(US9469597, 48 | US9670136, 48 N-(4′-((trans)...)
Show SMILES COc1ccc(NS(C)(=O)=O)cc1-c1ccc(cc1)[C@H]1C[C@@H]1NC1CCC(N)CC1 |r,wU:19.20,wD:21.24,(-2.03,-3.2,;-3.37,-3.95,;-4.7,-3.17,;-6.1,-3.85,;-7.44,-3.08,;-7.44,-1.54,;-8.77,-.77,;-10.11,-1.54,;-11.44,-2.31,;-11.44,-.77,;-10.11,-3.08,;-6.1,-.77,;-4.77,-1.54,;-3.44,-.77,;-2.1,-1.54,;-.77,-.77,;-.77,.77,;-2.1,1.54,;-3.44,.77,;.56,1.54,;1.33,2.87,;2.1,1.54,;3.44,.77,;4.77,1.54,;6.1,.77,;7.44,1.54,;7.44,3.08,;8.77,3.85,;6.1,3.85,;4.77,3.08,)|
Show InChI InChI=1S/C23H31N3O3S/c1-29-23-12-11-19(26-30(2,27)28)13-21(23)16-5-3-15(4-6-16)20-14-22(20)25-18-9-7-17(24)8-10-18/h3-6,11-13,17-18,20,22,25-26H,7-10,14,24H2,1-2H3/t17?,18?,20-,22+/m1/s1
US Patent
n/an/a 1.75E+4n/an/an/an/a7.537
Oryzon Genomics S.A.
US Patent
Assay Description
In order to monitor MAO enzymatic activities and/or their inhibition rate by inhibitor(s) of interest, a fluorescence-based (inhibitor)-screening ass...
US Patent US9469597 (2016)
BindingDB Entry DOI: 10.7270/Q2ZW1JVG
Amine oxidase [flavin-containing] B
(Homo sapiens (Human))
BDBM254589
(US9469597, 48 | US9670136, 48 N-(4′-((trans)...)
Show SMILES COc1ccc(NS(C)(=O)=O)cc1-c1ccc(cc1)[C@H]1C[C@@H]1NC1CCC(N)CC1 |r,wU:19.20,wD:21.24,(-2.03,-3.2,;-3.37,-3.95,;-4.7,-3.17,;-6.1,-3.85,;-7.44,-3.08,;-7.44,-1.54,;-8.77,-.77,;-10.11,-1.54,;-11.44,-2.31,;-11.44,-.77,;-10.11,-3.08,;-6.1,-.77,;-4.77,-1.54,;-3.44,-.77,;-2.1,-1.54,;-.77,-.77,;-.77,.77,;-2.1,1.54,;-3.44,.77,;.56,1.54,;1.33,2.87,;2.1,1.54,;3.44,.77,;4.77,1.54,;6.1,.77,;7.44,1.54,;7.44,3.08,;8.77,3.85,;6.1,3.85,;4.77,3.08,)|
Show InChI InChI=1S/C23H31N3O3S/c1-29-23-12-11-19(26-30(2,27)28)13-21(23)16-5-3-15(4-6-16)20-14-22(20)25-18-9-7-17(24)8-10-18/h3-6,11-13,17-18,20,22,25-26H,7-10,14,24H2,1-2H3/t17?,18?,20-,22+/m1/s1
US Patent
n/an/a>1.00E+5n/an/an/an/a7.537
Oryzon Genomics S.A.
US Patent
Assay Description
In order to monitor MAO enzymatic activities and/or their inhibition rate by inhibitor(s) of interest, a fluorescence-based (inhibitor)-screening ass...
US Patent US9469597 (2016)
BindingDB Entry DOI: 10.7270/Q2ZW1JVG
Lysine-specific histone demethylase 1A
(Homo sapiens (Human))
BDBM254589
(US9469597, 48 | US9670136, 48 N-(4′-((trans)...)
Show SMILES COc1ccc(NS(C)(=O)=O)cc1-c1ccc(cc1)[C@H]1C[C@@H]1NC1CCC(N)CC1 |r,wU:19.20,wD:21.24,(-2.03,-3.2,;-3.37,-3.95,;-4.7,-3.17,;-6.1,-3.85,;-7.44,-3.08,;-7.44,-1.54,;-8.77,-.77,;-10.11,-1.54,;-11.44,-2.31,;-11.44,-.77,;-10.11,-3.08,;-6.1,-.77,;-4.77,-1.54,;-3.44,-.77,;-2.1,-1.54,;-.77,-.77,;-.77,.77,;-2.1,1.54,;-3.44,.77,;.56,1.54,;1.33,2.87,;2.1,1.54,;3.44,.77,;4.77,1.54,;6.1,.77,;7.44,1.54,;7.44,3.08,;8.77,3.85,;6.1,3.85,;4.77,3.08,)|
Show InChI InChI=1S/C23H31N3O3S/c1-29-23-12-11-19(26-30(2,27)28)13-21(23)16-5-3-15(4-6-16)20-14-22(20)25-18-9-7-17(24)8-10-18/h3-6,11-13,17-18,20,22,25-26H,7-10,14,24H2,1-2H3/t17?,18?,20-,22+/m1/s1
Reactome pathway
US Patent
n/an/a 27n/an/an/an/a7.425
ORYZON GENOMICS S.A.
US Patent
Assay Description
Briefly, a fixed amount of LSD1 was incubated on ice for 15 minutes, in the absence and/or in the presence of at least eight 3-fold serial dilutions ...
US Patent US9670136 (2017)
BindingDB Entry DOI: 10.7270/Q2PN93SB
Amine oxidase (flavin-containing) A
(Homo sapiens (Human))
BDBM254589
(US9469597, 48 | US9670136, 48 N-(4′-((trans)...)
Show SMILES COc1ccc(NS(C)(=O)=O)cc1-c1ccc(cc1)[C@H]1C[C@@H]1NC1CCC(N)CC1 |r,wU:19.20,wD:21.24,(-2.03,-3.2,;-3.37,-3.95,;-4.7,-3.17,;-6.1,-3.85,;-7.44,-3.08,;-7.44,-1.54,;-8.77,-.77,;-10.11,-1.54,;-11.44,-2.31,;-11.44,-.77,;-10.11,-3.08,;-6.1,-.77,;-4.77,-1.54,;-3.44,-.77,;-2.1,-1.54,;-.77,-.77,;-.77,.77,;-2.1,1.54,;-3.44,.77,;.56,1.54,;1.33,2.87,;2.1,1.54,;3.44,.77,;4.77,1.54,;6.1,.77,;7.44,1.54,;7.44,3.08,;8.77,3.85,;6.1,3.85,;4.77,3.08,)|
Show InChI InChI=1S/C23H31N3O3S/c1-29-23-12-11-19(26-30(2,27)28)13-21(23)16-5-3-15(4-6-16)20-14-22(20)25-18-9-7-17(24)8-10-18/h3-6,11-13,17-18,20,22,25-26H,7-10,14,24H2,1-2H3/t17?,18?,20-,22+/m1/s1
US Patent
n/an/a 1.75E+4n/an/an/an/an/an/a
ORYZON GENOMICS S.A.
US Patent
Assay Description
Briefly, a fixed amount of MAO (0.25 μg for MAO-A and 0.5 μg for MAO-B) was incubated on ice for 15 minutes in the reaction buffer, in the ...
US Patent US9670136 (2017)
BindingDB Entry DOI: 10.7270/Q2PN93SB
Amine oxidase [flavin-containing] B
(Homo sapiens (Human))
BDBM254589
(US9469597, 48 | US9670136, 48 N-(4′-((trans)...)
Show SMILES COc1ccc(NS(C)(=O)=O)cc1-c1ccc(cc1)[C@H]1C[C@@H]1NC1CCC(N)CC1 |r,wU:19.20,wD:21.24,(-2.03,-3.2,;-3.37,-3.95,;-4.7,-3.17,;-6.1,-3.85,;-7.44,-3.08,;-7.44,-1.54,;-8.77,-.77,;-10.11,-1.54,;-11.44,-2.31,;-11.44,-.77,;-10.11,-3.08,;-6.1,-.77,;-4.77,-1.54,;-3.44,-.77,;-2.1,-1.54,;-.77,-.77,;-.77,.77,;-2.1,1.54,;-3.44,.77,;.56,1.54,;1.33,2.87,;2.1,1.54,;3.44,.77,;4.77,1.54,;6.1,.77,;7.44,1.54,;7.44,3.08,;8.77,3.85,;6.1,3.85,;4.77,3.08,)|
Show InChI InChI=1S/C23H31N3O3S/c1-29-23-12-11-19(26-30(2,27)28)13-21(23)16-5-3-15(4-6-16)20-14-22(20)25-18-9-7-17(24)8-10-18/h3-6,11-13,17-18,20,22,25-26H,7-10,14,24H2,1-2H3/t17?,18?,20-,22+/m1/s1
US Patent
n/an/a>1.00E+5n/an/an/an/an/an/a
ORYZON GENOMICS S.A.
US Patent
Assay Description
Briefly, a fixed amount of MAO (0.25 μg for MAO-A and 0.5 μg for MAO-B) was incubated on ice for 15 minutes in the reaction buffer, in the ...
US Patent US9670136 (2017)
BindingDB Entry DOI: 10.7270/Q2PN93SB
GST-Lysine Specific Demethylase-1 (LSD1)
(Homo sapiens (Human))
BDBM254589
(US9469597, 48 | US9670136, 48 N-(4′-((trans)...)
Show SMILES COc1ccc(NS(C)(=O)=O)cc1-c1ccc(cc1)[C@H]1C[C@@H]1NC1CCC(N)CC1 |r,wU:19.20,wD:21.24,(-2.03,-3.2,;-3.37,-3.95,;-4.7,-3.17,;-6.1,-3.85,;-7.44,-3.08,;-7.44,-1.54,;-8.77,-.77,;-10.11,-1.54,;-11.44,-2.31,;-11.44,-.77,;-10.11,-3.08,;-6.1,-.77,;-4.77,-1.54,;-3.44,-.77,;-2.1,-1.54,;-.77,-.77,;-.77,.77,;-2.1,1.54,;-3.44,.77,;.56,1.54,;1.33,2.87,;2.1,1.54,;3.44,.77,;4.77,1.54,;6.1,.77,;7.44,1.54,;7.44,3.08,;8.77,3.85,;6.1,3.85,;4.77,3.08,)|
Show InChI InChI=1S/C23H31N3O3S/c1-29-23-12-11-19(26-30(2,27)28)13-21(23)16-5-3-15(4-6-16)20-14-22(20)25-18-9-7-17(24)8-10-18/h3-6,11-13,17-18,20,22,25-26H,7-10,14,24H2,1-2H3/t17?,18?,20-,22+/m1/s1
US Patent
n/an/a 27n/an/an/an/a7.437
Oryzon Genomics S.A.
US Patent
Assay Description
The compounds of the invention can be tested for their ability to inhibit LSD1. The ability of the compounds of the invention to inhibit LSD1 can be ...
US Patent US9469597 (2016)
BindingDB Entry DOI: 10.7270/Q2ZW1JVG