BDBM254904 US9493472, 26
SMILES: CCO[C@@H]1CC(CO)N(C1)C(=O)c1cc(OC)c2oc(NC(CF)c3cccc(Cl)c3)nc2c1
InChI Key: InChIKey=RRAIZSNSKNCOGB-QPIRBTGLSA-N
Data: 1 IC50
Activity Spreadsheet -- Enzyme Inhibition Constant Data from BindingDB
Found 1 hit for monomerid = 254904
Trg + Lig
Ki
nM
ΔG°
kcal/mole
IC50
nM
Kd
nM
EC50/IC50
nM
koff
s-1
kon
M-1s-1
pHTemp
°C
Prothrombin
(Homo sapiens (Human))
BDBM254904
(US9493472, 26)
Show SMILES CCO[C@@H]1CC(CO)N(C1)C(=O)c1cc(OC)c2oc(NC(CF)c3cccc(Cl)c3)nc2c1 |r|
Show InChI InChI=1S/C24H27ClFN3O5/c1-3-33-18-10-17(13-30)29(12-18)23(31)15-8-19-22(21(9-15)32-2)34-24(27-19)28-20(11-26)14-5-4-6-16(25)7-14/h4-9,17-18,20,30H,3,10-13H2,1-2H3,(H,27,28)/t17?,18-,20?/m1/s1
US Patent
n/an/a 0.190n/an/an/an/a7.422
Bayer Pharma Aktiengesellschaft
US Patent
Assay Description
To determine the thrombin inhibition of the substances listed above, a biochemical test system is constructed in which the conversion of a thrombin s...
US Patent US9493472 (2016)
BindingDB Entry DOI: 10.7270/Q2B56HPW