BDBM254944 US9505765, 23
SMILES: CC(C)COc1ncnc2[nH]cc(C(=O)CCl)c12
InChI Key: InChIKey=KJHFJTDIYVBYIY-UHFFFAOYSA-N
Data: 1 IC50
Activity Spreadsheet -- Enzyme Inhibition Constant Data from BindingDB
Found 1 hit for monomerid = 254944
Trg + Lig
Ki
nM
ΔG°
kcal/mole
IC50
nM
Kd
nM
EC50/IC50
nM
koff
s-1
kon
M-1s-1
pHTemp
°C
Mitogen-activated protein kinase kinase kinase 7 interacting protein 1
(Homo sapiens (Human))
BDBM254944
(US9505765, 23)
Show SMILES CC(C)COc1ncnc2[nH]cc(C(=O)CCl)c12
Show InChI InChI=1S/C12H14ClN3O2/c1-7(2)5-18-12-10-8(9(17)3-13)4-14-11(10)15-6-16-12/h4,6-7H,3,5H2,1-2H3,(H,14,15,16)
US Patent
n/an/a 280n/an/an/an/an/an/a
CONFLUENCE LIFE SCIENCES INC.
US Patent
Assay Description
TAK1-TAB1 Binding Inhibitory Potency: The ability of candidate compounds to interact with TAK1-TAB1 is quantitated by a competitive binding assay usi...
US Patent US9505765 (2016)
BindingDB Entry DOI: 10.7270/Q2T43S1J