BDBM254992 US9475813, 48
SMILES: FC[C@H]1CC[C@@H](CC1)N1CN(CC#N)C(=O)c2cnc3[nH]ccc3c12
InChI Key:
Data: 4 IC50
Activity Spreadsheet -- Enzyme Inhibition Constant Data from BindingDB
Found 4 hits for monomerid = 254992
Trg + Lig
Ki
nM
ΔG°
kcal/mole
IC50
nM
Kd
nM
EC50/IC50
nM
koff
s-1
kon
M-1s-1
pHTemp
°C
Tyrosine-protein kinase JAK1
(Homo sapiens (Human))
BDBM254992
(US9475813, 48)
Show SMILES FC[C@H]1CC[C@@H](CC1)N1CN(CC#N)C(=O)c2cnc3[nH]ccc3c12 |r,wU:5.8,wD:2.1,(6.67,3.08,;5.33,3.85,;4,3.08,;2.67,3.85,;1.33,3.08,;1.33,1.54,;2.67,.77,;4,1.54,;,.77,;-1.33,1.54,;-2.67,.77,;-4,1.54,;-5.33,.77,;-6.67,,;-2.67,-.77,;-4,-1.54,;-1.33,-1.54,;-1.33,-3.08,;,-3.85,;1.33,-3.08,;2.8,-3.56,;3.7,-2.31,;2.8,-1.06,;1.33,-1.54,;,-.77,)|
Reactome pathway
US Patent
n/an/a 4.40n/an/an/an/an/an/a
Nissan Chemical Industries, Ltd.
US Patent
Assay Description
The inhibitory activity of the compounds of the present invention against JAK was measured.The respective enzymes (JAK1, JAK2, JAK3 and Tyk2) were pu...
US Patent US9475813 (2016)
BindingDB Entry DOI: 10.7270/Q2PC31BN
Non-receptor tyrosine-protein kinase TYK2
(Homo sapiens (Human))
BDBM254992
(US9475813, 48)
Show SMILES FC[C@H]1CC[C@@H](CC1)N1CN(CC#N)C(=O)c2cnc3[nH]ccc3c12 |r,wU:5.8,wD:2.1,(6.67,3.08,;5.33,3.85,;4,3.08,;2.67,3.85,;1.33,3.08,;1.33,1.54,;2.67,.77,;4,1.54,;,.77,;-1.33,1.54,;-2.67,.77,;-4,1.54,;-5.33,.77,;-6.67,,;-2.67,-.77,;-4,-1.54,;-1.33,-1.54,;-1.33,-3.08,;,-3.85,;1.33,-3.08,;2.8,-3.56,;3.7,-2.31,;2.8,-1.06,;1.33,-1.54,;,-.77,)|
US Patent
n/an/a 49n/an/an/an/an/an/a
Nissan Chemical Industries, Ltd.
US Patent
Assay Description
The inhibitory activity of the compounds of the present invention against JAK was measured.The respective enzymes (JAK1, JAK2, JAK3 and Tyk2) were pu...
US Patent US9475813 (2016)
BindingDB Entry DOI: 10.7270/Q2PC31BN
Tyrosine-protein kinase JAK3
(Homo sapiens (Human))
BDBM254992
(US9475813, 48)
Show SMILES FC[C@H]1CC[C@@H](CC1)N1CN(CC#N)C(=O)c2cnc3[nH]ccc3c12 |r,wU:5.8,wD:2.1,(6.67,3.08,;5.33,3.85,;4,3.08,;2.67,3.85,;1.33,3.08,;1.33,1.54,;2.67,.77,;4,1.54,;,.77,;-1.33,1.54,;-2.67,.77,;-4,1.54,;-5.33,.77,;-6.67,,;-2.67,-.77,;-4,-1.54,;-1.33,-1.54,;-1.33,-3.08,;,-3.85,;1.33,-3.08,;2.8,-3.56,;3.7,-2.31,;2.8,-1.06,;1.33,-1.54,;,-.77,)|
Reactome pathway
US Patent
n/an/a 39n/an/an/an/an/an/a
Nissan Chemical Industries, Ltd.
US Patent
Assay Description
The inhibitory activity of the compounds of the present invention against JAK was measured.The respective enzymes (JAK1, JAK2, JAK3 and Tyk2) were pu...
US Patent US9475813 (2016)
BindingDB Entry DOI: 10.7270/Q2PC31BN
Tyrosine-protein kinase JAK2
(Homo sapiens (Human))
BDBM254992
(US9475813, 48)
Show SMILES FC[C@H]1CC[C@@H](CC1)N1CN(CC#N)C(=O)c2cnc3[nH]ccc3c12 |r,wU:5.8,wD:2.1,(6.67,3.08,;5.33,3.85,;4,3.08,;2.67,3.85,;1.33,3.08,;1.33,1.54,;2.67,.77,;4,1.54,;,.77,;-1.33,1.54,;-2.67,.77,;-4,1.54,;-5.33,.77,;-6.67,,;-2.67,-.77,;-4,-1.54,;-1.33,-1.54,;-1.33,-3.08,;,-3.85,;1.33,-3.08,;2.8,-3.56,;3.7,-2.31,;2.8,-1.06,;1.33,-1.54,;,-.77,)|
Reactome pathway
US Patent
n/an/a 24n/an/an/an/an/an/a
Nissan Chemical Industries, Ltd.
US Patent
Assay Description
The inhibitory activity of the compounds of the present invention against JAK was measured.The respective enzymes (JAK1, JAK2, JAK3 and Tyk2) were pu...
US Patent US9475813 (2016)
BindingDB Entry DOI: 10.7270/Q2PC31BN