BDBM25544 4-arylamino-3-pyridinecarbonitrile, 4b::5-(3,4-dimethoxyphenyl)-4-(phenylamino)pyridine-3-carbonitrile
SMILES: COc1ccc(cc1OC)-c1cncc(C#N)c1Nc1ccccc1
InChI Key: InChIKey=HADPGAPRUBRVBB-UHFFFAOYSA-N
Data: 1 IC50
Activity Spreadsheet -- Enzyme Inhibition Constant Data from BindingDB
Found 1 hit for monomerid = 25544
Trg + Lig
Ki
nM
ΔG°
kcal/mole
IC50
nM
Kd
nM
EC50/IC50
nM
koff
s-1
kon
M-1s-1
pHTemp
°C
Protein kinase C theta type
(Homo sapiens (Human))
BDBM25544
(4-arylamino-3-pyridinecarbonitrile, 4b | 5-(3,4-di...)
Show SMILES COc1ccc(cc1OC)-c1cncc(C#N)c1Nc1ccccc1
Show InChI InChI=1S/C20H17N3O2/c1-24-18-9-8-14(10-19(18)25-2)17-13-22-12-15(11-21)20(17)23-16-6-4-3-5-7-16/h3-10,12-13H,1-2H3,(H,22,23)
NCI pathway
Reactome pathway
n/an/a 1.60E+3n/an/an/an/a7.222
Wyeth Research
Assay Description
All IC50s were measured by using a modified IMAP protocol from Molecular Devices. The kinase reaction was carried out in a Corning Costar 384 well pl...
J Med Chem 51: 5958-63 (2008)
Article DOI: 10.1021/jm800214a
BindingDB Entry DOI: 10.7270/Q21V5C8K