BDBM25545 4-[(3-chlorophenyl)amino]-5-(3,4-dimethoxyphenyl)pyridine-3-carbonitrile::4-arylamino-3-pyridinecarbonitrile, 4c
SMILES: COc1ccc(cc1OC)-c1cncc(C#N)c1Nc1cccc(Cl)c1
InChI Key: InChIKey=RNUFKODPSCMDIU-UHFFFAOYSA-N
Data: 1 IC50
Activity Spreadsheet -- Enzyme Inhibition Constant Data from BindingDB
Found 1 hit for monomerid = 25545
Trg + Lig
Ki
nM
ΔG°
kcal/mole
IC50
nM
Kd
nM
EC50/IC50
nM
koff
s-1
kon
M-1s-1
pHTemp
°C
Protein kinase C theta type
(Homo sapiens (Human))
BDBM25545
(4-[(3-chlorophenyl)amino]-5-(3,4-dimethoxyphenyl)p...)
Show SMILES COc1ccc(cc1OC)-c1cncc(C#N)c1Nc1cccc(Cl)c1
Show InChI InChI=1S/C20H16ClN3O2/c1-25-18-7-6-13(8-19(18)26-2)17-12-23-11-14(10-22)20(17)24-16-5-3-4-15(21)9-16/h3-9,11-12H,1-2H3,(H,23,24)
NCI pathway
Reactome pathway
n/an/a 3.90E+3n/an/an/an/a7.222
Wyeth Research
Assay Description
All IC50s were measured by using a modified IMAP protocol from Molecular Devices. The kinase reaction was carried out in a Corning Costar 384 well pl...
J Med Chem 51: 5958-63 (2008)
Article DOI: 10.1021/jm800214a
BindingDB Entry DOI: 10.7270/Q21V5C8K