BDBM25547 4-arylamino-3-pyridinecarbonitrile, 4e::5-(3,4-dimethoxyphenyl)-4-[(3-phenoxyphenyl)amino]pyridine-3-carbonitrile
SMILES: COc1ccc(cc1OC)-c1cncc(C#N)c1Nc1cccc(Oc2ccccc2)c1
InChI Key: InChIKey=KERSBDKYDOSALI-UHFFFAOYSA-N
Data: 1 IC50
Activity Spreadsheet -- Enzyme Inhibition Constant Data from BindingDB
Found 1 hit for monomerid = 25547
Trg + Lig
Ki
nM
ΔG°
kcal/mole
IC50
nM
Kd
nM
EC50/IC50
nM
koff
s-1
kon
M-1s-1
pHTemp
°C
Protein kinase C theta type
(Homo sapiens (Human))
BDBM25547
(4-arylamino-3-pyridinecarbonitrile, 4e | 5-(3,4-di...)
Show SMILES COc1ccc(cc1OC)-c1cncc(C#N)c1Nc1cccc(Oc2ccccc2)c1
Show InChI InChI=1S/C26H21N3O3/c1-30-24-12-11-18(13-25(24)31-2)23-17-28-16-19(15-27)26(23)29-20-7-6-10-22(14-20)32-21-8-4-3-5-9-21/h3-14,16-17H,1-2H3,(H,28,29)
NCI pathway
Reactome pathway
n/an/a>3.00E+4n/an/an/an/a7.222
Wyeth Research
Assay Description
All IC50s were measured by using a modified IMAP protocol from Molecular Devices. The kinase reaction was carried out in a Corning Costar 384 well pl...
J Med Chem 51: 5958-63 (2008)
Article DOI: 10.1021/jm800214a
BindingDB Entry DOI: 10.7270/Q21V5C8K