BDBM25551 4-arylamino-3-pyridinecarbonitrile, 4i::5-(3,4-dimethoxyphenyl)-4-[(4-methoxyphenyl)amino]pyridine-3-carbonitrile
SMILES: COc1ccc(Nc2c(cncc2-c2ccc(OC)c(OC)c2)C#N)cc1
InChI Key: InChIKey=OJGHWRDUNPVUAZ-UHFFFAOYSA-N
Data: 1 IC50
Activity Spreadsheet -- Enzyme Inhibition Constant Data from BindingDB
Found 1 hit for monomerid = 25551
Trg + Lig
Ki
nM
ΔG°
kcal/mole
IC50
nM
Kd
nM
EC50/IC50
nM
koff
s-1
kon
M-1s-1
pHTemp
°C
Protein kinase C theta type
(Homo sapiens (Human))
BDBM25551
(4-arylamino-3-pyridinecarbonitrile, 4i | 5-(3,4-di...)
Show SMILES COc1ccc(Nc2c(cncc2-c2ccc(OC)c(OC)c2)C#N)cc1
Show InChI InChI=1S/C21H19N3O3/c1-25-17-7-5-16(6-8-17)24-21-15(11-22)12-23-13-18(21)14-4-9-19(26-2)20(10-14)27-3/h4-10,12-13H,1-3H3,(H,23,24)
NCI pathway
Reactome pathway
n/an/a 400n/an/an/an/a7.222
Wyeth Research
Assay Description
All IC50s were measured by using a modified IMAP protocol from Molecular Devices. The kinase reaction was carried out in a Corning Costar 384 well pl...
J Med Chem 51: 5958-63 (2008)
Article DOI: 10.1021/jm800214a
BindingDB Entry DOI: 10.7270/Q21V5C8K