BDBM25556 4-[(3,4-dichlorophenyl)amino]-5-(3,4-dimethoxyphenyl)pyridine-3-carbonitrile::4-arylamino-3-pyridinecarbonitrile, 4n
SMILES: COc1ccc(cc1OC)-c1cncc(C#N)c1Nc1ccc(Cl)c(Cl)c1
InChI Key: InChIKey=YXCVCJPIKTXOSA-UHFFFAOYSA-N
Data: 1 IC50
Activity Spreadsheet -- Enzyme Inhibition Constant Data from BindingDB
Found 1 hit for monomerid = 25556
Trg + Lig
Ki
nM
ΔG°
kcal/mole
IC50
nM
Kd
nM
EC50/IC50
nM
koff
s-1
kon
M-1s-1
pHTemp
°C
Protein kinase C theta type
(Homo sapiens (Human))
BDBM25556
(4-[(3,4-dichlorophenyl)amino]-5-(3,4-dimethoxyphen...)
Show SMILES COc1ccc(cc1OC)-c1cncc(C#N)c1Nc1ccc(Cl)c(Cl)c1
Show InChI InChI=1S/C20H15Cl2N3O2/c1-26-18-6-3-12(7-19(18)27-2)15-11-24-10-13(9-23)20(15)25-14-4-5-16(21)17(22)8-14/h3-8,10-11H,1-2H3,(H,24,25)
NCI pathway
Reactome pathway
n/an/a 2.40E+3n/an/an/an/a7.222
Wyeth Research
Assay Description
All IC50s were measured by using a modified IMAP protocol from Molecular Devices. The kinase reaction was carried out in a Corning Costar 384 well pl...
J Med Chem 51: 5958-63 (2008)
Article DOI: 10.1021/jm800214a
BindingDB Entry DOI: 10.7270/Q21V5C8K