BDBM256064 US9481672, 246
SMILES: Cn1c2ccc(cc2n(CC(O)C(F)(F)F)c1=O)-n1cc(C(O)=O)c(=O)n([C@@H]2CCc3c2cccc3C(F)(F)F)c1=O
InChI Key: InChIKey=YHYCAIBUKDMBKX-DIAVIDTQSA-N
Data: 1 IC50
Activity Spreadsheet -- Enzyme Inhibition Constant Data from BindingDB
Found 1 hit for monomerid = 256064
Trg + Lig
Ki
nM
ΔG°
kcal/mole
IC50
nM
Kd
nM
EC50/IC50
nM
koff
s-1
kon
M-1s-1
pHTemp
°C
Chymase
(Mesocricetus auratus (Golden hamster))
BDBM256064
(US9481672, 246)
Show SMILES Cn1c2ccc(cc2n(CC(O)C(F)(F)F)c1=O)-n1cc(C(O)=O)c(=O)n([C@@H]2CCc3c2cccc3C(F)(F)F)c1=O |r|
Show InChI InChI=1S/C26H20F6N4O6/c1-33-18-7-5-12(9-19(18)35(23(33)41)11-20(37)26(30,31)32)34-10-15(22(39)40)21(38)36(24(34)42)17-8-6-13-14(17)3-2-4-16(13)25(27,28)29/h2-5,7,9-10,17,20,37H,6,8,11H2,1H3,(H,39,40)/t17-,20?/m1/s1
US Patent
n/an/a 1n/an/an/an/a7.5n/a
Bayer Pharma Aktiengesellschaft
US Patent
Assay Description
The enzyme source used is recombinant human chymase (expressed in HEK293 cells) or chymase purified from hamsters' tongues. The substrate used for ch...
US Patent US9481672 (2016)
BindingDB Entry DOI: 10.7270/Q20P0XZ7