BDBM256365 US9487490, 4M
SMILES: C[C@H]1CN(C[C@@H](C)O1)C(=O)c1ccc2c(nn(C(=O)c3c(Cl)cccc3C(F)(F)F)c2c1)C1=CCC(CC1)C(O)=O
InChI Key: InChIKey=KRWYLIPIAGZVDR-BYICEURKSA-N
Data: 1 IC50
Activity Spreadsheet -- Enzyme Inhibition Constant Data from BindingDB
Found 1 hit for monomerid = 256365
Trg + Lig
Ki
nM
ΔG°
kcal/mole
IC50
nM
Kd
nM
EC50/IC50
nM
koff
s-1
kon
M-1s-1
pHTemp
°C
Isoform 2 of Nuclear receptor ROR-gamma
(Homo sapiens (Human))
BDBM256365
(US9487490, 4M)
Show SMILES C[C@H]1CN(C[C@@H](C)O1)C(=O)c1ccc2c(nn(C(=O)c3c(Cl)cccc3C(F)(F)F)c2c1)C1=CCC(CC1)C(O)=O |r,t:36|
Show InChI InChI=1S/C29H27ClF3N3O5/c1-15-13-35(14-16(2)41-15)26(37)19-10-11-20-23(12-19)36(34-25(20)17-6-8-18(9-7-17)28(39)40)27(38)24-21(29(31,32)33)4-3-5-22(24)30/h3-6,10-12,15-16,18H,7-9,13-14H2,1-2H3,(H,39,40)/t15-,16+,18?
US Patent
n/an/a 21n/an/an/an/a7.04
Merck Sharp & Dohme Corp.
US Patent
Assay Description
To identify novel antagonists of RORgammaT, an assay was developed which employs the interaction of RORgammaT with its co-activator peptide SRC1_2. T...
US Patent US9487490 (2016)
BindingDB Entry DOI: 10.7270/Q2GQ6WQN