BDBM256374 US9487490, 4V
SMILES: COCCN(C)C(=O)c1ccc2c(nn(C(=O)c3c(Cl)cccc3C(F)(F)F)c2c1)C1=CCC(CC1)C(O)=O
InChI Key: InChIKey=PPTPDSALMTVJCV-UHFFFAOYSA-N
Data: 1 IC50
Activity Spreadsheet -- Enzyme Inhibition Constant Data from BindingDB
Found 1 hit for monomerid = 256374
Trg + Lig
Ki
nM
ΔG°
kcal/mole
IC50
nM
Kd
nM
EC50/IC50
nM
koff
s-1
kon
M-1s-1
pHTemp
°C
Isoform 2 of Nuclear receptor ROR-gamma
(Homo sapiens (Human))
BDBM256374
(US9487490, 4V)
Show SMILES COCCN(C)C(=O)c1ccc2c(nn(C(=O)c3c(Cl)cccc3C(F)(F)F)c2c1)C1=CCC(CC1)C(O)=O |t:33|
Show InChI InChI=1S/C27H25ClF3N3O5/c1-33(12-13-39-2)24(35)17-10-11-18-21(14-17)34(32-23(18)15-6-8-16(9-7-15)26(37)38)25(36)22-19(27(29,30)31)4-3-5-20(22)28/h3-6,10-11,14,16H,7-9,12-13H2,1-2H3,(H,37,38)
US Patent
n/an/a 31n/an/an/an/a7.04
Merck Sharp & Dohme Corp.
US Patent
Assay Description
To identify novel antagonists of RORgammaT, an assay was developed which employs the interaction of RORgammaT with its co-activator peptide SRC1_2. T...
US Patent US9487490 (2016)
BindingDB Entry DOI: 10.7270/Q2GQ6WQN