BDBM25661 5-bromo-N-(4-fluorophenyl)-N-methyl-1,3-thiazol-2-amine::aminothiazole analogue, 5
SMILES: CN(c1ncc(Br)s1)c1ccc(F)cc1
InChI Key: InChIKey=YMECUWXFMPJSJH-UHFFFAOYSA-N
Data: 1 IC50
Activity Spreadsheet -- Enzyme Inhibition Constant Data from BindingDB
Found 1 hit for monomerid = 25661
Trg + Lig
Ki
nM
ΔG°
kcal/mole
IC50
nM
Kd
nM
EC50/IC50
nM
koff
s-1
kon
M-1s-1
pHTemp
°C
Aurora kinase A
(Homo sapiens (Human))
BDBM25661
(5-bromo-N-(4-fluorophenyl)-N-methyl-1,3-thiazol-2-...)
Show SMILES CN(c1ncc(Br)s1)c1ccc(F)cc1
Show InChI InChI=1S/C10H8BrFN2S/c1-14(10-13-6-9(11)15-10)8-4-2-7(12)3-5-8/h2-6H,1H3
NCI pathway
Reactome pathway
n/an/a>1.00E+4n/an/an/an/a7.022
Novartis
Assay Description
The biochemical activity of compounds was determined by incubation with Aurora A and substrates in the presence ATP/[gamma-33P] ATP. After incubatio...
ACS Chem Biol 3: 180-92 (2008)
Article DOI: 10.1021/cb700200w
BindingDB Entry DOI: 10.7270/Q2HX1B03