BDBM25664 5-bromo-N-(4-bromophenyl)-1,3-thiazol-2-amine::aminothiazole analogue, 8
SMILES: Brc1cnc(Nc2ccc(Br)cc2)s1
InChI Key: InChIKey=MFPKWRAOAXNZFV-UHFFFAOYSA-N
Data: 1 IC50
Activity Spreadsheet -- Enzyme Inhibition Constant Data from BindingDB
Found 1 hit for monomerid = 25664
Trg + Lig
Ki
nM
ΔG°
kcal/mole
IC50
nM
Kd
nM
EC50/IC50
nM
koff
s-1
kon
M-1s-1
pHTemp
°C
Aurora kinase A
(Homo sapiens (Human))
BDBM25664
(5-bromo-N-(4-bromophenyl)-1,3-thiazol-2-amine | am...)
Show SMILES Brc1cnc(Nc2ccc(Br)cc2)s1
Show InChI InChI=1S/C9H6Br2N2S/c10-6-1-3-7(4-2-6)13-9-12-5-8(11)14-9/h1-5H,(H,12,13)
NCI pathway
Reactome pathway
n/an/a 2.90E+3n/an/an/an/a7.022
Novartis
Assay Description
The biochemical activity of compounds was determined by incubation with Aurora A and substrates in the presence ATP/[gamma-33P] ATP. After incubatio...
ACS Chem Biol 3: 180-92 (2008)
Article DOI: 10.1021/cb700200w
BindingDB Entry DOI: 10.7270/Q2HX1B03