BDBM25672 5-bromo-N-(4-phenoxyphenyl)-1,3-thiazol-2-amine::aminothiazole analogue, 16
SMILES: Brc1cnc(Nc2ccc(Oc3ccccc3)cc2)s1
InChI Key: InChIKey=DZGOYVWFZPLZDR-UHFFFAOYSA-N
Data: 1 IC50
Activity Spreadsheet -- Enzyme Inhibition Constant Data from BindingDB
Found 1 hit for monomerid = 25672
Trg + Lig
Ki
nM
ΔG°
kcal/mole
IC50
nM
Kd
nM
EC50/IC50
nM
koff
s-1
kon
M-1s-1
pHTemp
°C
Aurora kinase A
(Homo sapiens (Human))
BDBM25672
(5-bromo-N-(4-phenoxyphenyl)-1,3-thiazol-2-amine | ...)
Show SMILES Brc1cnc(Nc2ccc(Oc3ccccc3)cc2)s1
Show InChI InChI=1S/C15H11BrN2OS/c16-14-10-17-15(20-14)18-11-6-8-13(9-7-11)19-12-4-2-1-3-5-12/h1-10H,(H,17,18)
NCI pathway
Reactome pathway
n/an/a 1.40E+3n/an/an/an/a7.022
Novartis
Assay Description
The biochemical activity of compounds was determined by incubation with Aurora A and substrates in the presence ATP/[gamma-33P] ATP. After incubatio...
ACS Chem Biol 3: 180-92 (2008)
Article DOI: 10.1021/cb700200w
BindingDB Entry DOI: 10.7270/Q2HX1B03