BDBM25675 5-bromo-N-(4-nitrophenyl)-1,3-thiazol-2-amine::aminothiazole analogue, 19
SMILES: [O-][N+](=O)c1ccc(Nc2ncc(Br)s2)cc1
InChI Key: InChIKey=KZBDTDUPILBSCQ-UHFFFAOYSA-N
Data: 1 IC50
Activity Spreadsheet -- Enzyme Inhibition Constant Data from BindingDB
Found 1 hit for monomerid = 25675
Trg + Lig
Ki
nM
ΔG°
kcal/mole
IC50
nM
Kd
nM
EC50/IC50
nM
koff
s-1
kon
M-1s-1
pHTemp
°C
Aurora kinase A
(Homo sapiens (Human))
BDBM25675
(5-bromo-N-(4-nitrophenyl)-1,3-thiazol-2-amine | am...)
Show SMILES [O-][N+](=O)c1ccc(Nc2ncc(Br)s2)cc1
Show InChI InChI=1S/C9H6BrN3O2S/c10-8-5-11-9(16-8)12-6-1-3-7(4-2-6)13(14)15/h1-5H,(H,11,12)
NCI pathway
Reactome pathway
n/an/a 1.30E+4n/an/an/an/a7.022
Novartis
Assay Description
The biochemical activity of compounds was determined by incubation with Aurora A and substrates in the presence ATP/[gamma-33P] ATP. After incubatio...
ACS Chem Biol 3: 180-92 (2008)
Article DOI: 10.1021/cb700200w
BindingDB Entry DOI: 10.7270/Q2HX1B03