BDBM25707 5-bromo-N-(3,5-dichlorophenyl)-1,3-thiazol-2-amine::aminothiazole analogue, 51
SMILES: Clc1cc(Cl)cc(Nc2ncc(Br)s2)c1
InChI Key: InChIKey=BOFJZZWSKIGISA-UHFFFAOYSA-N
Data: 1 IC50
Activity Spreadsheet -- Enzyme Inhibition Constant Data from BindingDB
Found 1 hit for monomerid = 25707
Trg + Lig
Ki
nM
ΔG°
kcal/mole
IC50
nM
Kd
nM
EC50/IC50
nM
koff
s-1
kon
M-1s-1
pHTemp
°C
Aurora kinase A
(Homo sapiens (Human))
BDBM25707
(5-bromo-N-(3,5-dichlorophenyl)-1,3-thiazol-2-amine...)
Show SMILES Clc1cc(Cl)cc(Nc2ncc(Br)s2)c1
Show InChI InChI=1S/C9H5BrCl2N2S/c10-8-4-13-9(15-8)14-7-2-5(11)1-6(12)3-7/h1-4H,(H,13,14)
NCI pathway
Reactome pathway
n/an/a>1.00E+4n/an/an/an/an/an/a
Novartis
Assay Description
The biochemical activity of compounds was determined by incubation with Aurora A and substrates in the presence ATP/[gamma-33P] ATP. After incubatio...
ACS Chem Biol 3: 180-92 (2008)
Article DOI: 10.1021/cb700200w
BindingDB Entry DOI: 10.7270/Q2HX1B03