BDBM25709 N-[3,5-bis(trifluoromethyl)phenyl]-5-bromo-1,3-thiazol-2-amine::aminothiazole analogue, 53
SMILES: FC(F)(F)c1cc(Nc2ncc(Br)s2)cc(c1)C(F)(F)F
InChI Key: InChIKey=AKROENBNDUQJEZ-UHFFFAOYSA-N
Data: 1 IC50
Activity Spreadsheet -- Enzyme Inhibition Constant Data from BindingDB
Found 1 hit for monomerid = 25709
Trg + Lig
Ki
nM
ΔG°
kcal/mole
IC50
nM
Kd
nM
EC50/IC50
nM
koff
s-1
kon
M-1s-1
pHTemp
°C
Aurora kinase A
(Homo sapiens (Human))
BDBM25709
(N-[3,5-bis(trifluoromethyl)phenyl]-5-bromo-1,3-thi...)
Show SMILES FC(F)(F)c1cc(Nc2ncc(Br)s2)cc(c1)C(F)(F)F
Show InChI InChI=1S/C11H5BrF6N2S/c12-8-4-19-9(21-8)20-7-2-5(10(13,14)15)1-6(3-7)11(16,17)18/h1-4H,(H,19,20)
NCI pathway
Reactome pathway
n/an/a>1.00E+4n/an/an/an/an/an/a
Novartis
Assay Description
The biochemical activity of compounds was determined by incubation with Aurora A and substrates in the presence ATP/[gamma-33P] ATP. After incubatio...
ACS Chem Biol 3: 180-92 (2008)
Article DOI: 10.1021/cb700200w
BindingDB Entry DOI: 10.7270/Q2HX1B03