BDBM257175 US9493440, 16
SMILES: C[C@@H]1CN(CCN1C)c1cc(ncn1)-c1n[nH]c2ccc(OC3(C)CC3)cc12
InChI Key:
Data: 1 IC50
Activity Spreadsheet -- Enzyme Inhibition Constant Data from BindingDB
Found 1 hit for monomerid = 257175
Trg + Lig
Ki
nM
ΔG°
kcal/mole
IC50
nM
Kd
nM
EC50/IC50
nM
koff
s-1
kon
M-1s-1
pHTemp
°C
Leucine-rich repeat serine/threonine-protein kinase 2 (LRRK2)(G2019S)
(Homo sapiens (Human))
BDBM257175
(US9493440, 16)
Show SMILES C[C@@H]1CN(CCN1C)c1cc(ncn1)-c1n[nH]c2ccc(OC3(C)CC3)cc12 |r|
US Patent
n/an/a<0.600n/an/an/an/a8.525
Merck Sharp & Dohme Corp.
US Patent
Assay Description
a) 400 nl of a 1:2.15 serial dilution of test compound (98 uM top assay concentration) is spotted via Labcyte Echo to certain wells in a 384 well bla...
US Patent US9493440 (2016)
BindingDB Entry DOI: 10.7270/Q2668C4X