BDBM258227 US9493448, 134::US9845313, Example 134
SMILES: Cn1nccc1[C@H]1CCC(F)(F)C[C@@H]1Oc1cc(F)c(cc1Cl)S(=O)(=O)Nc1nncs1
InChI Key: InChIKey=MDFYIWOQFGSUBU-BMIGLBTASA-N
Data: 2 IC50
Activity Spreadsheet -- Enzyme Inhibition Constant Data from BindingDB
Found 2 hits for monomerid = 258227
Trg + Lig
Ki
nM
ΔG°
kcal/mole
IC50
nM
Kd
nM
EC50/IC50
nM
koff
s-1
kon
M-1s-1
pHTemp
°C
Sodium channel protein type 9 subunit alpha
(Homo sapiens (Human))
BDBM258227
(US9493448, 134 | US9845313, Example 134)
Show SMILES Cn1nccc1[C@H]1CCC(F)(F)C[C@@H]1Oc1cc(F)c(cc1Cl)S(=O)(=O)Nc1nncs1 |r|
Show InChI InChI=1S/C18H17ClF3N5O3S2/c1-27-13(3-5-24-27)10-2-4-18(21,22)8-15(10)30-14-7-12(20)16(6-11(14)19)32(28,29)26-17-25-23-9-31-17/h3,5-7,9-10,15H,2,4,8H2,1H3,(H,25,26)/t10-,15+/m1/s1
US Patent
n/an/a 34n/an/an/an/an/an/a
DAIICHI SANKYO COMPANY, LIMITED
US Patent
Assay Description
Current record was obtained by an automated patch clamp system “IonWorks Quattro (Molecular Devices Corporation)” in Population Patch Clamp mode. The...
US Patent US9845313 (2017)
BindingDB Entry DOI: 10.7270/Q25141H5
Sodium channel protein type 9 subunit alpha
(Homo sapiens (Human))
BDBM258227
(US9493448, 134 | US9845313, Example 134)
Show SMILES Cn1nccc1[C@H]1CCC(F)(F)C[C@@H]1Oc1cc(F)c(cc1Cl)S(=O)(=O)Nc1nncs1 |r|
Show InChI InChI=1S/C18H17ClF3N5O3S2/c1-27-13(3-5-24-27)10-2-4-18(21,22)8-15(10)30-14-7-12(20)16(6-11(14)19)32(28,29)26-17-25-23-9-31-17/h3,5-7,9-10,15H,2,4,8H2,1H3,(H,25,26)/t10-,15+/m1/s1
US Patent
n/an/a 34n/an/an/an/a7.337
DAIICHI SANKYO COMPANY, LIMITED
US Patent
Assay Description
Current record was obtained by an automated patch clamp system IonWorks Quattro (Molecular Devices Corporation) in Population Patch Clamp mode. The o...
US Patent US9493448 (2016)
BindingDB Entry DOI: 10.7270/Q29022QD