BDBM258497 US10633384, Example 1.19::US9493486, 1.19
SMILES: Clc1cc(Cl)cc(COC(=O)N2CCC3(C2)CCN(CC3)C(=O)c2ccc3[nH]nnc3c2)c1
InChI Key: InChIKey=VKGKTWSBQKAVNC-UHFFFAOYSA-N
Data: 2 IC50
Activity Spreadsheet -- Enzyme Inhibition Constant Data from BindingDB
Found 2 hits for monomerid = 258497
Trg + Lig
Ki
nM
ΔG°
kcal/mole
IC50
nM
Kd
nM
EC50/IC50
nM
koff
s-1
kon
M-1s-1
pHTemp
°C
Ataxin-2
(Homo sapiens (Human))
BDBM258497
(US10633384, Example 1.19 | US9493486, 1.19)
Show SMILES Clc1cc(Cl)cc(COC(=O)N2CCC3(C2)CCN(CC3)C(=O)c2ccc3[nH]nnc3c2)c1
Show InChI InChI=1S/C23H23Cl2N5O3/c24-17-9-15(10-18(25)12-17)13-33-22(32)30-8-5-23(14-30)3-6-29(7-4-23)21(31)16-1-2-19-20(11-16)27-28-26-19/h1-2,9-12H,3-8,13-14H2,(H,26,27,28)
US Patent
n/an/a 39.5n/an/an/an/an/an/a
Hoffmann-La Roche Inc.
US Patent
Assay Description
ATX inhibition was measured by a fluorescence quenching assay using a specifically labeled substrate analogue (MR121 substrate). To obtain this MR121...
US Patent US10633384 (2020)
Ectonucleotide pyrophosphatase/phosphodiesterase family member 2
(Homo sapiens (Human))
BDBM258497
(US10633384, Example 1.19 | US9493486, 1.19)
Show SMILES Clc1cc(Cl)cc(COC(=O)N2CCC3(C2)CCN(CC3)C(=O)c2ccc3[nH]nnc3c2)c1
Show InChI InChI=1S/C23H23Cl2N5O3/c24-17-9-15(10-18(25)12-17)13-33-22(32)30-8-5-23(14-30)3-6-29(7-4-23)21(31)16-1-2-19-20(11-16)27-28-26-19/h1-2,9-12H,3-8,13-14H2,(H,26,27,28)
US Patent
n/an/a 39.5n/an/an/an/a8.030
Hoffmann-La Roches Inc.
US Patent
Assay Description
ATX inhibition was measured by a fluorescence quenching assay using a specifically labeled substrate analogue (MR121 substrate). To obtain this MR121...
US Patent US9493486 (2016)
BindingDB Entry DOI: 10.7270/Q2VT1R1K