BDBM258510 US10633384, Example 3::US9493486, 3
SMILES: Clc1cc(Cl)cc(COC(=O)N2CCC3(CN(C3)S(=O)(=O)c3ccc4[nH]c(=O)oc4c3)CC2)c1
InChI Key: InChIKey=YBTQPVUNAIIYFN-UHFFFAOYSA-N
Data: 2 IC50
Activity Spreadsheet -- Enzyme Inhibition Constant Data from BindingDB
Found 2 hits for monomerid = 258510
Trg + Lig
Ki
nM
ΔG°
kcal/mole
IC50
nM
Kd
nM
EC50/IC50
nM
koff
s-1
kon
M-1s-1
pHTemp
°C
Ataxin-2
(Homo sapiens (Human))
BDBM258510
(US10633384, Example 3 | US9493486, 3)
Show SMILES Clc1cc(Cl)cc(COC(=O)N2CCC3(CN(C3)S(=O)(=O)c3ccc4[nH]c(=O)oc4c3)CC2)c1
Show InChI InChI=1S/C22H21Cl2N3O6S/c23-15-7-14(8-16(24)9-15)11-32-21(29)26-5-3-22(4-6-26)12-27(13-22)34(30,31)17-1-2-18-19(10-17)33-20(28)25-18/h1-2,7-10H,3-6,11-13H2,(H,25,28)
US Patent
n/an/a 6n/an/an/an/an/an/a
Hoffmann-La Roche Inc.
US Patent
Assay Description
ATX inhibition was measured by a fluorescence quenching assay using a specifically labeled substrate analogue (MR121 substrate). To obtain this MR121...
US Patent US10633384 (2020)
Ectonucleotide pyrophosphatase/phosphodiesterase family member 2
(Homo sapiens (Human))
BDBM258510
(US10633384, Example 3 | US9493486, 3)
Show SMILES Clc1cc(Cl)cc(COC(=O)N2CCC3(CN(C3)S(=O)(=O)c3ccc4[nH]c(=O)oc4c3)CC2)c1
Show InChI InChI=1S/C22H21Cl2N3O6S/c23-15-7-14(8-16(24)9-15)11-32-21(29)26-5-3-22(4-6-26)12-27(13-22)34(30,31)17-1-2-18-19(10-17)33-20(28)25-18/h1-2,7-10H,3-6,11-13H2,(H,25,28)
US Patent
n/an/a 6n/an/an/an/a8.030
Hoffmann-La Roches Inc.
US Patent
Assay Description
ATX inhibition was measured by a fluorescence quenching assay using a specifically labeled substrate analogue (MR121 substrate). To obtain this MR121...
US Patent US9493486 (2016)
BindingDB Entry DOI: 10.7270/Q2VT1R1K