BDBM258577 US10633384, Example 12.39::US9493486, 12.39
SMILES: FC(F)(F)COc1ccc(COC(=O)N2CCC3(CN(C3)C(=O)C3CCc4nn[nH]c4C3)CC2)cc1
InChI Key:
Data: 2 IC50
Activity Spreadsheet -- Enzyme Inhibition Constant Data from BindingDB
Found 2 hits for monomerid = 258577
Trg + Lig
Ki
nM
ΔG°
kcal/mole
IC50
nM
Kd
nM
EC50/IC50
nM
koff
s-1
kon
M-1s-1
pHTemp
°C
Ataxin-2
(Homo sapiens (Human))
BDBM258577
(US10633384, Example 12.39 | US9493486, 12.39)
Show SMILES FC(F)(F)COc1ccc(COC(=O)N2CCC3(CN(C3)C(=O)C3CCc4nn[nH]c4C3)CC2)cc1
US Patent
n/an/a 5n/an/an/an/an/an/a
Hoffmann-La Roche Inc.
US Patent
Assay Description
ATX inhibition was measured by a fluorescence quenching assay using a specifically labeled substrate analogue (MR121 substrate). To obtain this MR121...
US Patent US10633384 (2020)
Ectonucleotide pyrophosphatase/phosphodiesterase family member 2
(Homo sapiens (Human))
BDBM258577
(US10633384, Example 12.39 | US9493486, 12.39)
Show SMILES FC(F)(F)COc1ccc(COC(=O)N2CCC3(CN(C3)C(=O)C3CCc4nn[nH]c4C3)CC2)cc1
US Patent
n/an/a 5n/an/an/an/a8.030
Hoffmann-La Roches Inc.
US Patent
Assay Description
ATX inhibition was measured by a fluorescence quenching assay using a specifically labeled substrate analogue (MR121 substrate). To obtain this MR121...
US Patent US9493486 (2016)
BindingDB Entry DOI: 10.7270/Q2VT1R1K